{"text_format":"3","workbook":"xlsx","n_sheets":9,"sheets":["TDB","depts","deptAvecNum","testDept","Config","calculTMB","donnees","nomRegions","nomDept"],"not_rendered":{"charts":5,"images":1,"macros":1,"defined_names":16},"read":"whole","date_system":"1900"}

{"sheet":"TDB","index":0,"n_rows":42,"n_cols":30,"rows_kept":42,"merged":[[1,1,2,6],[1,7,2,14],[2,23,2,24],[3,7,3,14],[3,23,5,24],[6,23,6,24],[8,16,8,25],[11,18,11,20],[11,21,11,23],[12,18,12,20],[12,21,12,23],[22,17,22,24],[23,18,23,24],[24,18,24,24],[25,18,25,24],[27,17,27,24],[28,18,28,24],[29,18,29,24],[30,1,30,6],[30,18,30,24],[32,17,32,24],[33,7,33,10],[33,18,33,24],[34,18,34,24],[35,18,35,24],[40,15,40,25],[41,15,41,25]]}
[{"$nulls":28},"q"]
[null,{"$f":"rappel","v":"France: résultats MCB 2015"},{"$nulls":5},"Excel1895: TABLEAU DE BORD ",{"$nulls":21},"http://www.lemonde.fr/carte-departements/"]
[{"$nulls":23},{"$f":"UPPER(TEXT(TODAY(),\"mmm\"))","v":"MARS"}]
[{"$nulls":7},"MCB: Résultats régionaux 2015",{"$nulls":15},{"$f":"UPPER(TEXT(TODAY(),\"j\"))","v":"11"}]
[]
[]
[{"$nulls":23},{"$f":"UPPER(TEXT(TODAY(),\"aaaa\"))","v":"2016"}]
[]
[{"$nulls":16},"Infos clés"]
[]
[{"$nulls":28},"44R","Alsace-Champagne-Ardenne-Lorraine"]
[{"$nulls":18},{"$f":"I36","v":2015},null,null,{"$f":"J36","v":2014},{"$nulls":6},"75R","Aquitaine-Limousin-Poitou-Charentes"]
[{"$nulls":17},"CA:",{"$f":"calculTMB!G19","v":{"v":3489416.96,"d":"3,489,417 €"}},null,null,{"$f":"calculTMB!H19","v":{"v":3296256.65,"d":"3,296,257 €"}},null,null,{"$f":"(S13-V13)/V13","v":{"v":0.05859989998048242,"d":"6%"}},{"$nulls":3},"84R","Auvergne-Rhône-Alpes"]
[{"$nulls":28},"27R","Bourgogne-Franche-Comté"]
[{"$nulls":28},"53R","Bretagne"]
{"$rows_left_out":28}
{"sheet":"depts","index":1,"n_rows":0,"n_cols":0,"rows_kept":0,"hidden":true}

{"sheet":"deptAvecNum","index":2,"n_rows":0,"n_cols":0,"rows_kept":0,"hidden":true}

{"sheet":"testDept","index":3,"n_rows":0,"n_cols":0,"rows_kept":0,"hidden":true}

{"sheet":"Config","index":4,"n_rows":5,"n_cols":10,"rows_kept":5}
[]
[{"$nulls":6},{"v":0,"d":"0%"},"<75%",null,"classe0"]
[{"$nulls":6},{"v":0.75,"d":"75%"},"75% et < 85%",null,"classe1"]
[{"$nulls":6},{"v":0.85,"d":"85%"},"85% et < 100%",null,"classe2"]
[{"$nulls":6},{"v":1.01,"d":"101%"},">101%",null,"classe3"]

{"sheet":"calculTMB","index":5,"n_rows":42,"n_cols":12,"rows_kept":42,"hidden":true,"merged":[[8,0,8,4]]}
[{"$nulls":7},"Bretagne"]
[{"$nulls":8},"nomRegion","2011","2012","rang"]
[{"$nulls":8},"Corse",1701,1430,{"$f":"IF($H$1=I3,K3,\"\")","v":""}]
["grapheD",2012,2011,{"$nulls":5},"Normandie",2255,2336,{"$f":"IF($H$1=I4,K4,\"\")","v":""}]
["MCB",{"$f":"SUM(donnees!$G$2:$G$420)","v":1688343.7900000007},{"$f":"SUM(donnees!$E$2:$E$420)","v":1628074.430000001},{"$nulls":5},"Provence-Alpes-Côte d'Azur",3134,3121,""]
["CT",{"$f":"SUM(donnees!$L$2:$L$420)","v":1773988.0999999999},{"$f":"SUM(donnees!$K$2:$K$420)","v":1710086.7999999996},{"$nulls":5},"Pays de la Loire",1811,3363,""]
["TMB",{"$f":"B5/B6","v":{"v":0.9517221620595995,"d":"95.17%"}},{"$f":"C5/C6","v":{"v":0.9520419840677102,"d":"95.20%"}},{"$f":"((C5*1.25)/C6*1.1)","v":{"v":1.3090577280931015,"d":"131%"}},{"$nulls":4},"Bretagne",1407,3412,3412]
[{"$nulls":8},"Centre-Val de Loire",1844,3770,""]
["top 5 des produits les plus vendus dans la région (Dept)",{"$nulls":7},"Nord-Pas-de-Calais-Picardie",1942,4167,""]
["France",2012,2011,{"$nulls":5},"Île-de-France",3956,5357,""]
["Fromage",{"$f":"SUMIF(donnees!$D:$D,calculTMB!$A11,donnees!$J:$J)","v":144857},{"$f":"SUMIF(donnees!$D:$D,calculTMB!$A11,donnees!$H:$H)","v":136561},"Fromage",{"v":3,"d":"3.00 €"},{"$nulls":3},"Bourgogne-Franche-Comté",3172,6838,""]
["Lait",{"$f":"SUMIF(donnees!$D:$D,calculTMB!$A12,donnees!$J:$J)","v":139804},{"$f":"SUMIF(donnees!$D:$D,calculTMB!$A12,donnees!$H:$H)","v":133935},"Lait",{"v":3.99,"d":"3.99 €"},{"$nulls":3},"Auvergne-Rhône-Alpes",4950,7487,""]
["Riz",{"$f":"SUMIF(donnees!$D:$D,calculTMB!$A13,donnees!$J:$J)","v":145215},{"$f":"SUMIF(donnees!$D:$D,calculTMB!$A13,donnees!$H:$H)","v":153121},"Riz",{"v":4.5,"d":"4.50 €"},{"$nulls":3},"Alsace-Champagne-Ardenne-Lorraine",4854,7499,""]
["Sucre",{"$f":"SUMIF(donnees!$D:$D,calculTMB!$A14,donnees!$J:$J)","v":146581},{"$f":"SUMIF(donnees!$D:$D,calculTMB!$A14,donnees!$H:$H)","v":138877},"Sucre",{"v":6.5,"d":"6.50 €"},{"$nulls":3},"Languedoc-Roussillon-Midi-Pyrénées",5642,8216,""]
["Yaourt",{"$f":"SUMIF(donnees!$D:$D,calculTMB!$A15,donnees!$J:$J)","v":148464},{"$f":"SUMIF(donnees!$D:$D,calculTMB!$A15,donnees!$H:$H)","v":126738},"Yaourt",{"v":6,"d":"6.00 €"},{"$nulls":3},"Aquitaine-Limousin-Poitou-Charentes",5486,8890,""]
{"$rows_left_out":28}
{"sheet":"donnees","index":6,"n_rows":420,"n_cols":19,"rows_kept":420}
["numDept","nomDept","nomReg","nomProd","MCB_2014","MCB_Cible_2015","MCB_2015","QteV_2014","QteCible","QteV_2015","CT_2014","CT_2015",{"$nulls":4},"nomProduit","coutProd","prixProd"]
[1,"Ain","Auvergne-Rhône-Alpes","Fromage",{"$f":"H2*VLOOKUP($D2,$Q$2:$S$6,3,0)-K2","v":{"v":2730.2000000000003,"d":"2,730 $"}},{"$f":"I2*VLOOKUP($D2,$Q$2:$S$6,3,0)-I2*VLOOKUP($D2,$Q$2:$S$6,2,0)","v":{"v":3275.8,"d":"3,276 $"}},{"$f":"J2*VLOOKUP($D2,$Q$2:$S$6,3,0)-L2","v":{"v":4928,"d":"4,928 $"}},1241,{"$f":"INT(H2*1.2)","v":1489},2240,{"$f":"H2*VLOOKUP($D2,$Q$2:$S$6,2,0)","v":{"v":2854.2999999999997,"d":"2,854 $"}},{"$f":"J2*VLOOKUP($D2,$Q$2:$S$6,2,0)","v":{"v":5152,"d":"5,152 $"}},{"$nulls":4},"Yaourt",{"v":1.5,"d":"1.50 €"},{"v":3,"d":"3.00 €"}]
[1,"Ain","Auvergne-Rhône-Alpes","Lait",{"$f":"H3*VLOOKUP($D3,$Q$2:$S$6,3,0)-K3","v":{"v":4743,"d":"4,743 $"}},{"$f":"I3*VLOOKUP($D3,$Q$2:$S$6,3,0)-I3*VLOOKUP($D3,$Q$2:$S$6,2,0)","v":{"v":5691,"d":"5,691 $"}},{"$f":"J3*VLOOKUP($D3,$Q$2:$S$6,3,0)-L3","v":{"v":3996,"d":"3,996 $"}},1581,{"$f":"INT(H3*1.2)","v":1897},1332,{"$f":"H3*VLOOKUP($D3,$Q$2:$S$6,2,0)","v":{"v":5533.5,"d":"5,534 $"}},{"$f":"J3*VLOOKUP($D3,$Q$2:$S$6,2,0)","v":{"v":4662,"d":"4,662 $"}},{"$nulls":4},"Sucre",{"v":2,"d":"2.00 €"},{"v":3.99,"d":"3.99 €"}]
[1,"Ain","Auvergne-Rhône-Alpes","Sucre",{"v":7960,"d":"7,960 $"},{"v":9552,"d":"9,552 $"},{"$f":"J4*VLOOKUP($D4,$Q$2:$S$6,3,0)-L4","v":{"v":4230.74,"d":"4,231 $"}},4000,4800,2126,{"v":8000,"d":"8,000 $"},{"v":4252,"d":"4,252 $"},{"$nulls":4},"Fromage",{"v":2.3,"d":"2.30 €"},{"v":4.5,"d":"4.50 €"}]
[1,"Ain","Auvergne-Rhône-Alpes","Riz",{"v":6294,"d":"6,294 $"},{"v":7551,"d":"7,551 $"},{"v":6750,"d":"6,750 $"},2098,2517,2250,{"v":6294,"d":"6,294 $"},{"v":6750,"d":"6,750 $"},{"$nulls":4},"Lait",{"v":3.5,"d":"3.50 €"},{"v":6.5,"d":"6.50 €"}]
[1,"Ain","Auvergne-Rhône-Alpes","Yaourt",{"v":3601.5,"d":"3,602 $"},{"v":4321.5,"d":"4,322 $"},{"v":2730,"d":"2,730 $"},2401,2881,1820,{"v":3601.5,"d":"3,602 $"},{"v":2730,"d":"2,730 $"},{"$nulls":4},"Riz",{"v":3,"d":"3.00 €"},{"v":6,"d":"6.00 €"}]
[2,"Aisne","Nord-Pas-de-Calais-Picardie","Riz",{"v":7086,"d":"7,086 $"},{"v":8502,"d":"8,502 $"},{"v":4116,"d":"4,116 $"},2362,2834,1372,{"v":7086,"d":"7,086 $"},{"v":4116,"d":"4,116 $"}]
[2,"Aisne","Nord-Pas-de-Calais-Picardie","Fromage",{"v":2415.6000000000004,"d":"2,416 $"},{"v":2897.4,"d":"2,897 $"},{"v":2499.2000000000003,"d":"2,499 $"},1098,1317,1136,{"v":2525.3999999999996,"d":"2,525 $"},{"v":2612.7999999999997,"d":"2,613 $"}]
[2,"Aisne","Nord-Pas-de-Calais-Picardie","Sucre",{"v":5012.810000000001,"d":"5,013 $"},{"v":6013.780000000001,"d":"6,014 $"},{"v":3223.8,"d":"3,224 $"},2519,3022,1620,{"v":5038,"d":"5,038 $"},{"v":3240,"d":"3,240 $"}]
[2,"Aisne","Nord-Pas-de-Calais-Picardie","Yaourt",{"v":360,"d":"360 $"},{"v":432,"d":"432 $"},{"v":2383.5,"d":"2,384 $"},240,288,1589,{"v":360,"d":"360 $"},{"v":2383.5,"d":"2,384 $"}]
[3,"Allier","Auvergne-Rhône-Alpes","Sucre",{"v":2911.37,"d":"2,911 $"},{"v":3492.4500000000007,"d":"3,492 $"},{"v":2220.84,"d":"2,221 $"},1463,1755,1116,{"v":2926,"d":"2,926 $"},{"v":2232,"d":"2,232 $"}]
[3,"Allier","Auvergne-Rhône-Alpes","Fromage",{"v":4138.200000000001,"d":"4,138 $"},{"v":4965.400000000001,"d":"4,965 $"},{"v":5570.400000000001,"d":"5,570 $"},1881,2257,2532,{"v":4326.299999999999,"d":"4,326 $"},{"v":5823.599999999999,"d":"5,824 $"}]
[3,"Allier","Auvergne-Rhône-Alpes","Yaourt",{"v":561,"d":"561 $"},{"v":672,"d":"672 $"},{"v":3267,"d":"3,267 $"},374,448,2178,{"v":561,"d":"561 $"},{"v":3267,"d":"3,267 $"}]
[3,"Allier","Auvergne-Rhône-Alpes","Lait",{"v":8595,"d":"8,595 $"},{"v":10314,"d":"10,314 $"},{"v":4230,"d":"4,230 $"},2865,3438,1410,{"v":10027.5,"d":"10,028 $"},{"v":4935,"d":"4,935 $"}]
[3,"Allier","Auvergne-Rhône-Alpes","Riz",{"v":8217,"d":"8,217 $"},{"v":9858,"d":"9,858 $"},{"v":6072,"d":"6,072 $"},2739,3286,2024,{"v":8217,"d":"8,217 $"},{"v":6072,"d":"6,072 $"}]
{"$rows_left_out":406}
{"sheet":"nomRegions","index":7,"n_rows":66,"n_cols":20,"rows_kept":66,"hidden":true,"merged":[[17,10,17,13]]}
["numReg","nomReg","Cibles","Résultat",null,null,"numReg","pourcReg",{"$nulls":8},"nomDept","nomProd",2014,2015]
["44R","Alsace-Champagne-Ardenne-Lorraine",{"$f":"SUMIF(donnees!$C$2:$C$420,$B2,donnees!$F$2:$F$420)","v":{"v":223138.21999999997,"d":"223,138 $"}},{"$f":"SUMIF(donnees!$C$2:$C$420,$B2,donnees!$G$2:$G$420)","v":{"v":188311.25000000003,"d":"188,311 $"}},{"$f":"VLOOKUP(D2/C2,classeReg,4,1)","v":"classe1"},null,"44P",{"$f":"D2/C2","v":{"v":0.84392198700877,"d":"84%"}},"Alsace-Champagne-Ardenne-Lorraine","F","76R",{"$nulls":4},{"$f":"Q2&ROW()","v":"Alsace-Champagne-Ardenne-Lorraine2"},"Alsace-Champagne-Ardenne-Lorraine","Fromage",{"$f":"SUMIFS(donnees!$E$2:$E$420,donnees!$D$2:$D$420,nomRegions!$R2,donnees!$C$2:$C$420,nomRegions!$Q2)","v":33228.80000000001},{"$f":"SUMIFS(donnees!$G$2:$G$420,donnees!$D$2:$D$420,nomRegions!$R2,donnees!$C$2:$C$420,nomRegions!$Q2)","v":32936.2}]
["75R","Aquitaine-Limousin-Poitou-Charentes",{"$f":"SUMIF(donnees!$C$2:$C$420,$B3,donnees!$F$2:$F$420)","v":{"v":266339.02,"d":"266,339 $"}},{"$f":"SUMIF(donnees!$C$2:$C$420,$B3,donnees!$G$2:$G$420)","v":{"v":217147.10999999996,"d":"217,147 $"}},{"$f":"VLOOKUP(D3/C3,classeReg,4,1)","v":"classe1"},null,"75P",{"$f":"D3/C3","v":{"v":0.8153034054116439,"d":"82%"}},{"$nulls":7},{"$f":"Q3&ROW()","v":"Alsace-Champagne-Ardenne-Lorraine3"},"Alsace-Champagne-Ardenne-Lorraine","Lait",{"$f":"SUMIFS(donnees!$E$2:$E$420,donnees!$D$2:$D$420,nomRegions!$R3,donnees!$C$2:$C$420,nomRegions!$Q3)","v":49755},{"$f":"SUMIFS(donnees!$G$2:$G$420,donnees!$D$2:$D$420,nomRegions!$R3,donnees!$C$2:$C$420,nomRegions!$Q3)","v":44895}]
["84R","Auvergne-Rhône-Alpes",{"$f":"SUMIF(donnees!$C$2:$C$420,$B4,donnees!$F$2:$F$420)","v":{"v":239036.97999999998,"d":"239,037 $"}},{"$f":"SUMIF(donnees!$C$2:$C$420,$B4,donnees!$G$2:$G$420)","v":{"v":236882.44,"d":"236,882 $"}},"classe2",null,"84P",{"v":0.9909865829128197,"d":"99%"},{"$nulls":7},"Alsace-Champagne-Ardenne-Lorraine4","Alsace-Champagne-Ardenne-Lorraine","Riz",{"$f":"SUMIFS(donnees!$E$2:$E$420,donnees!$D$2:$D$420,nomRegions!$R4,donnees!$C$2:$C$420,nomRegions!$Q4)","v":58566},{"$f":"SUMIFS(donnees!$G$2:$G$420,donnees!$D$2:$D$420,nomRegions!$R4,donnees!$C$2:$C$420,nomRegions!$Q4)","v":61416}]
["27R","Bourgogne-Franche-Comté",{"$f":"SUMIF(donnees!$C$2:$C$420,$B5,donnees!$F$2:$F$420)","v":{"v":146495.05000000002,"d":"146,495 $"}},{"$f":"SUMIF(donnees!$C$2:$C$420,$B5,donnees!$G$2:$G$420)","v":{"v":118605.51999999999,"d":"118,606 $"}},"classe1",null,"27P",{"v":0.8096213489807333,"d":"81%"},null,{"$f":"IFERROR(VLOOKUP(idRegion,$A$2:$B$14,2,0),\"\")","v":"Languedoc-Roussillon-Midi-Pyrénées"},{"$nulls":5},"Alsace-Champagne-Ardenne-Lorraine5","Alsace-Champagne-Ardenne-Lorraine","Sucre",{"$f":"SUMIFS(donnees!$E$2:$E$420,donnees!$D$2:$D$420,nomRegions!$R5,donnees!$C$2:$C$420,nomRegions!$Q5)","v":27364.490000000005},{"$f":"SUMIFS(donnees!$G$2:$G$420,donnees!$D$2:$D$420,nomRegions!$R5,donnees!$C$2:$C$420,nomRegions!$Q5)","v":32526.550000000003}]
["53R","Bretagne",{"$f":"SUMIF(donnees!$C$2:$C$420,$B6,donnees!$F$2:$F$420)","v":{"v":61000.54000000001,"d":"61,001 $"}},{"$f":"SUMIF(donnees!$C$2:$C$420,$B6,donnees!$G$2:$G$420)","v":{"v":65875.35,"d":"65,875 $"}},"classe3",null,"53P",{"v":1.0799142105955126,"d":"108%"},{"$nulls":7},"Alsace-Champagne-Ardenne-Lorraine6","Alsace-Champagne-Ardenne-Lorraine","Yaourt",{"$f":"SUMIFS(donnees!$E$2:$E$420,donnees!$D$2:$D$420,nomRegions!$R6,donnees!$C$2:$C$420,nomRegions!$Q6)","v":17068.5},{"$f":"SUMIFS(donnees!$G$2:$G$420,donnees!$D$2:$D$420,nomRegions!$R6,donnees!$C$2:$C$420,nomRegions!$Q6)","v":16537.5}]
["24R","Centre-Val de Loire",{"$f":"SUMIF(donnees!$C$2:$C$420,$B7,donnees!$F$2:$F$420)","v":{"v":122432.40000000002,"d":"122,432 $"}},{"$f":"SUMIF(donnees!$C$2:$C$420,$B7,donnees!$G$2:$G$420)","v":{"v":100413.26000000001,"d":"100,413 $"}},"classe1",null,"24P",{"v":0.8201526720051228,"d":"82%"},null,null,"nomDept","nomProd",2014,2015,null,"Aquitaine-Limousin-Poitou-Charentes7","Aquitaine-Limousin-Poitou-Charentes","Fromage",{"$f":"SUMIFS(donnees!$E$2:$E$420,donnees!$D$2:$D$420,nomRegions!$R7,donnees!$C$2:$C$420,nomRegions!$Q7)","v":32348.800000000007},{"$f":"SUMIFS(donnees!$G$2:$G$420,donnees!$D$2:$D$420,nomRegions!$R7,donnees!$C$2:$C$420,nomRegions!$Q7)","v":43551.2}]
["94R","Corse",{"$f":"SUMIF(donnees!$C$2:$C$420,$B8,donnees!$F$2:$F$420)","v":{"v":41257.83,"d":"41,258 $"}},{"$f":"SUMIF(donnees!$C$2:$C$420,$B8,donnees!$G$2:$G$420)","v":{"v":24763.57,"d":"24,764 $"}},"classe0",null,"94P",{"v":0.6002150379697623,"d":"60%"},null,null,{"$f":"IFERROR($J$5& MATCH($J$5,$Q:$Q,0),\"\")","v":"Languedoc-Roussillon-Midi-Pyrénées42"},{"$f":"IFERROR(VLOOKUP($K8,detailsRegion,COLUMN(S1)-COLUMN($P$1),0),\"\")","v":"Fromage"},{"v":48846.600000000006,"d":"48,847 €"},{"v":46050.399999999994,"d":"46,050 €"},null,"Aquitaine-Limousin-Poitou-Charentes8","Aquitaine-Limousin-Poitou-Charentes","Lait",{"$f":"SUMIFS(donnees!$E$2:$E$420,donnees!$D$2:$D$420,nomRegions!$R8,donnees!$C$2:$C$420,nomRegions!$Q8)","v":69819},{"$f":"SUMIFS(donnees!$G$2:$G$420,donnees!$D$2:$D$420,nomRegions!$R8,donnees!$C$2:$C$420,nomRegions!$Q8)","v":48900}]
["11R","Île-de-France",{"$f":"SUMIF(donnees!$C$2:$C$420,$B9,donnees!$F$2:$F$420)","v":{"v":151705.29000000004,"d":"151,705 $"}},{"$f":"SUMIF(donnees!$C$2:$C$420,$B9,donnees!$G$2:$G$420)","v":{"v":124593.42000000001,"d":"124,593 $"}},"classe1",null,"11P",{"v":0.8212859287899583,"d":"82%"},null,null,{"$f":"IFERROR($J$5& MATCH($J$5,$Q:$Q,0)+ROW(O1),\"\")","v":"Languedoc-Roussillon-Midi-Pyrénées43"},"Lait",{"v":52122,"d":"52,122 €"},{"v":62547,"d":"62,547 €"},null,"Aquitaine-Limousin-Poitou-Charentes9","Aquitaine-Limousin-Poitou-Charentes","Riz",{"$f":"SUMIFS(donnees!$E$2:$E$420,donnees!$D$2:$D$420,nomRegions!$R9,donnees!$C$2:$C$420,nomRegions!$Q9)","v":56649},{"$f":"SUMIFS(donnees!$G$2:$G$420,donnees!$D$2:$D$420,nomRegions!$R9,donnees!$C$2:$C$420,nomRegions!$Q9)","v":48210}]
["76R","Languedoc-Roussillon-Midi-Pyrénées",{"$f":"SUMIF(donnees!$C$2:$C$420,$B10,donnees!$F$2:$F$420)","v":{"v":270783.95999999996,"d":"270,784 $"}},{"$f":"SUMIF(donnees!$C$2:$C$420,$B10,donnees!$G$2:$G$420)","v":{"v":243337.73,"d":"243,338 $"}},"classe2",null,"76P",{"v":0.8986415960531785,"d":"90%"},null,null,{"$f":"IFERROR($J$5& MATCH($J$5,$Q:$Q,0)+ROW(O2),\"\")","v":"Languedoc-Roussillon-Midi-Pyrénées44"},"Riz",{"v":55569,"d":"55,569 €"},{"v":58782,"d":"58,782 €"},null,"Aquitaine-Limousin-Poitou-Charentes10","Aquitaine-Limousin-Poitou-Charentes","Sucre",{"$f":"SUMIFS(donnees!$E$2:$E$420,donnees!$D$2:$D$420,nomRegions!$R10,donnees!$C$2:$C$420,nomRegions!$Q10)","v":36570.23},{"$f":"SUMIFS(donnees!$G$2:$G$420,donnees!$D$2:$D$420,nomRegions!$R10,donnees!$C$2:$C$420,nomRegions!$Q10)","v":44096.41000000001}]
["32R","Nord-Pas-de-Calais-Picardie",{"$f":"SUMIF(donnees!$C$2:$C$420,$B11,donnees!$F$2:$F$420)","v":{"v":79599.09,"d":"79,599 $"}},{"$f":"SUMIF(donnees!$C$2:$C$420,$B11,donnees!$G$2:$G$420)","v":{"v":85567.16,"d":"85,567 $"}},"classe3",null,"32P",{"v":1.0749766109135168,"d":"107%"},null,null,"Languedoc-Roussillon-Midi-Pyrénées45","Sucre",{"v":40824.850000000006,"d":"40,825 €"},{"v":41923.329999999994,"d":"41,923 €"},null,"Aquitaine-Limousin-Poitou-Charentes11","Aquitaine-Limousin-Poitou-Charentes","Yaourt",{"$f":"SUMIFS(donnees!$E$2:$E$420,donnees!$D$2:$D$420,nomRegions!$R11,donnees!$C$2:$C$420,nomRegions!$Q11)","v":26608.5},{"$f":"SUMIFS(donnees!$G$2:$G$420,donnees!$D$2:$D$420,nomRegions!$R11,donnees!$C$2:$C$420,nomRegions!$Q11)","v":32389.5}]
["28R","Normandie",{"$f":"SUMIF(donnees!$C$2:$C$420,$B12,donnees!$F$2:$F$420)","v":{"v":112642.37,"d":"112,642 $"}},{"$f":"SUMIF(donnees!$C$2:$C$420,$B12,donnees!$G$2:$G$420)","v":{"v":84073.48000000001,"d":"84,073 $"}},"classe0",null,"28P",{"v":0.7463752760173638,"d":"75%"},null,null,"Languedoc-Roussillon-Midi-Pyrénées46","Yaourt",{"v":28329,"d":"28,329 €"},{"v":34035,"d":"34,035 €"},null,"Auvergne-Rhône-Alpes12","Auvergne-Rhône-Alpes","Fromage",{"$f":"SUMIFS(donnees!$E$2:$E$420,donnees!$D$2:$D$420,nomRegions!$R12,donnees!$C$2:$C$420,nomRegions!$Q12)","v":43296.00000000001},{"$f":"SUMIFS(donnees!$G$2:$G$420,donnees!$D$2:$D$420,nomRegions!$R12,donnees!$C$2:$C$420,nomRegions!$Q12)","v":47942.4}]
["52R","Pays de la Loire",{"$f":"SUMIF(donnees!$C$2:$C$420,$B13,donnees!$F$2:$F$420)","v":{"v":114019.40999999997,"d":"114,019 $"}},{"$f":"SUMIF(donnees!$C$2:$C$420,$B13,donnees!$G$2:$G$420)","v":{"v":98214.63999999998,"d":"98,215 $"}},"classe2",null,"52P",{"v":0.8613852676487276,"d":"86%"},{"$nulls":3},"total",{"$f":"SUM(M8:M12)","v":{"v":225691.45,"d":"225,691 €"}},{"$f":"SUM(N8:N12)","v":{"v":243337.72999999998,"d":"243,338 €"}},null,"Auvergne-Rhône-Alpes13","Auvergne-Rhône-Alpes","Lait",{"$f":"SUMIFS(donnees!$E$2:$E$420,donnees!$D$2:$D$420,nomRegions!$R13,donnees!$C$2:$C$420,nomRegions!$Q13)","v":48138},{"$f":"SUMIFS(donnees!$G$2:$G$420,donnees!$D$2:$D$420,nomRegions!$R13,donnees!$C$2:$C$420,nomRegions!$Q13)","v":58830}]
["93R","Provence-Alpes-Côte d'Azur",{"$f":"SUMIF(donnees!$C$2:$C$420,$B14,donnees!$F$2:$F$420)","v":{"v":124639.66000000002,"d":"124,640 $"}},{"$f":"SUMIF(donnees!$C$2:$C$420,$B14,donnees!$G$2:$G$420)","v":{"v":100558.86,"d":"100,559 $"}},"classe1",null,"93P",{"v":0.806796648835531,"d":"81%"},{"$nulls":7},"Auvergne-Rhône-Alpes14","Auvergne-Rhône-Alpes","Riz",{"$f":"SUMIFS(donnees!$E$2:$E$420,donnees!$D$2:$D$420,nomRegions!$R14,donnees!$C$2:$C$420,nomRegions!$Q14)","v":54936},{"$f":"SUMIFS(donnees!$G$2:$G$420,donnees!$D$2:$D$420,nomRegions!$R14,donnees!$C$2:$C$420,nomRegions!$Q14)","v":68034}]
[null,"Total",{"$f":"SUM(C2:C14)","v":{"v":1953089.8199999998,"d":"1,953,090 $"}},{"$f":"SUM(D2:D14)","v":{"v":1688343.7899999998,"d":"1,688,344 $"}},{"$nulls":11},"Auvergne-Rhône-Alpes15","Auvergne-Rhône-Alpes","Sucre",{"$f":"SUMIFS(donnees!$E$2:$E$420,donnees!$D$2:$D$420,nomRegions!$R15,donnees!$C$2:$C$420,nomRegions!$Q15)","v":37722.44},{"$f":"SUMIFS(donnees!$G$2:$G$420,donnees!$D$2:$D$420,nomRegions!$R15,donnees!$C$2:$C$420,nomRegions!$Q15)","v":34717.54}]
{"$rows_left_out":52}
{"sheet":"nomDept","index":8,"n_rows":420,"n_cols":20,"rows_kept":420,"hidden":true}
["numDept","nomDept","Cibles","Résultat",null,null,"numDept",{"$nulls":9},"nomDept","nomProd",2014,2015]
[1,"Ain",{"$f":"SUMIF(donnees!$B$2:$B$420,$B2,donnees!$F$2:$F$420)","v":{"v":30391.3,"d":"30,391.30 $"}},{"$f":"SUMIF(donnees!$B$2:$B$420,$B2,donnees!$G$2:$G$420)","v":{"v":22634.739999999998,"d":"22,634.74 $"}},{"$f":"VLOOKUP(D2/C2,classeReg,4,1)","v":"classe0"},{"$f":"D2/C2","v":0.7447769591955592},1,{"$f":"B2&\" (\"&G2&\")\"","v":"Ain (1)"},"txtHexagone",{"$nulls":6},{"$f":"Q2&ROW()","v":"Ain2"},"Ain","Fromage",{"$f":"donnees!E2","v":{"v":2730.2000000000003,"d":"2,730 $"}},{"$f":"donnees!G2","v":{"v":4928,"d":"4,928 $"}}]
[2,"Aisne",{"$f":"SUMIF(donnees!$B$2:$B$420,$B3,donnees!$F$2:$F$420)","v":{"v":17845.18,"d":"17,845.18 $"}},{"$f":"SUMIF(donnees!$B$2:$B$420,$B3,donnees!$G$2:$G$420)","v":{"v":12222.5,"d":"12,222.50 $"}},"classe0",{"$f":"D3/C3","v":0.6849188408298488},2,{"$f":"B3&\" (\"&G3&\")\"","v":"Aisne (2)"},{"$nulls":7},{"$f":"Q3&ROW()","v":"Ain3"},"Ain","Lait",{"$f":"donnees!E3","v":{"v":4743,"d":"4,743 $"}},{"$f":"donnees!G3","v":{"v":3996,"d":"3,996 $"}}]
[3,"Allier",{"$f":"SUMIF(donnees!$B$2:$B$420,$B4,donnees!$F$2:$F$420)","v":{"v":29301.850000000002,"d":"29,301.85 $"}},{"$f":"SUMIF(donnees!$B$2:$B$420,$B4,donnees!$G$2:$G$420)","v":{"v":21360.24,"d":"21,360.24 $"}},"classe0",0.7289724027663782,3,"Allier (3)",{"$nulls":7},"Ain4","Ain","Sucre",{"$f":"donnees!E4","v":{"v":7960,"d":"7,960 $"}},{"$f":"donnees!G4","v":{"v":4230.74,"d":"4,231 $"}}]
[4,"Alpes-de-Haute-Provence",{"$f":"SUMIF(donnees!$B$2:$B$420,$B5,donnees!$F$2:$F$420)","v":{"v":25660.54,"d":"25,660.54 $"}},{"$f":"SUMIF(donnees!$B$2:$B$420,$B5,donnees!$G$2:$G$420)","v":{"v":13672.3,"d":"13,672.30 $"}},"classe0",0.5328141964276667,4,"Alpes-de-Haute-Provence (4)",{"$nulls":7},"Ain5","Ain","Riz",{"$f":"donnees!E5","v":{"v":6294,"d":"6,294 $"}},{"$f":"donnees!G5","v":{"v":6750,"d":"6,750 $"}}]
[5,"Hautes-Alpes",{"$f":"SUMIF(donnees!$B$2:$B$420,$B6,donnees!$F$2:$F$420)","v":{"v":9114,"d":"9,114.00 $"}},{"$f":"SUMIF(donnees!$B$2:$B$420,$B6,donnees!$G$2:$G$420)","v":{"v":14565,"d":"14,565.00 $"}},"classe3",1.5980908492429229,5,"Hautes-Alpes (5)",null,{"$f":"IFERROR(VLOOKUP(idDept,$A$2:$B$97,2,0),\"\")","v":""},{"$nulls":5},"Ain6","Ain","Yaourt",{"$f":"donnees!E6","v":{"v":3601.5,"d":"3,602 $"}},{"$f":"donnees!G6","v":{"v":2730,"d":"2,730 $"}}]
[6,"Alpes-Maritimes",{"$f":"SUMIF(donnees!$B$2:$B$420,$B7,donnees!$F$2:$F$420)","v":{"v":23161.9,"d":"23,161.90 $"}},{"$f":"SUMIF(donnees!$B$2:$B$420,$B7,donnees!$G$2:$G$420)","v":{"v":13846.220000000001,"d":"13,846.22 $"}},"classe0",0.5978015620480185,6,"Alpes-Maritimes (6)",null,null,"nomDept","nomProd",2014,2015,null,"Aisne7","Aisne","Riz",{"$f":"donnees!E7","v":{"v":7086,"d":"7,086 $"}},{"$f":"donnees!G7","v":{"v":4116,"d":"4,116 $"}}]
[7,"Ardèche",{"$f":"SUMIF(donnees!$B$2:$B$420,$B8,donnees!$F$2:$F$420)","v":{"v":18555.24,"d":"18,555.24 $"}},{"$f":"SUMIF(donnees!$B$2:$B$420,$B8,donnees!$G$2:$G$420)","v":{"v":22981.6,"d":"22,981.60 $"}},"classe3",1.238550404090704,7,"Ardèche (7)",null,null,{"$f":"IFERROR($J$6& MATCH($J$6,$Q:$Q,0),\"\")","v":""},{"$f":"IFERROR(VLOOKUP($K8,detailsDept,COLUMN(S1)-COLUMN($P$1),0),\"\")","v":""},"","",null,{"$f":"Q8&ROW()","v":"Aisne8"},"Aisne","Fromage",{"$f":"donnees!E8","v":{"v":2415.6000000000004,"d":"2,416 $"}},{"$f":"donnees!G8","v":{"v":2499.2000000000003,"d":"2,499 $"}}]
[8,"Ardennes",{"$f":"SUMIF(donnees!$B$2:$B$420,$B9,donnees!$F$2:$F$420)","v":{"v":29108.6,"d":"29,108.60 $"}},{"$f":"SUMIF(donnees!$B$2:$B$420,$B9,donnees!$G$2:$G$420)","v":{"v":12933.7,"d":"12,933.70 $"}},"classe0",0.44432573191427965,8,"Ardennes (8)",null,null,{"$f":"IFERROR($J$6& MATCH($J$6,$Q:$Q,0)+ROW(O1),\"\")","v":""},"","","",null,{"$f":"Q9&ROW()","v":"Aisne9"},"Aisne","Sucre",{"$f":"donnees!E9","v":{"v":5012.810000000001,"d":"5,013 $"}},{"$f":"donnees!G9","v":{"v":3223.8,"d":"3,224 $"}}]
[9,"Ariège",{"$f":"SUMIF(donnees!$B$2:$B$420,$B10,donnees!$F$2:$F$420)","v":{"v":21028.5,"d":"21,028.50 $"}},{"$f":"SUMIF(donnees!$B$2:$B$420,$B10,donnees!$G$2:$G$420)","v":{"v":19168.76,"d":"19,168.76 $"}},"classe2",0.9115609767696221,9,"Ariège (9)",null,null,{"$f":"IFERROR($J$6& MATCH($J$6,$Q:$Q,0)+ROW(O2),\"\")","v":""},"","","",null,"Aisne10","Aisne","Yaourt",{"$f":"donnees!E10","v":{"v":360,"d":"360 $"}},{"$f":"donnees!G10","v":{"v":2383.5,"d":"2,384 $"}}]
[10,"Aube",{"$f":"SUMIF(donnees!$B$2:$B$420,$B11,donnees!$F$2:$F$420)","v":{"v":34731.62,"d":"34,731.62 $"}},{"$f":"SUMIF(donnees!$B$2:$B$420,$B11,donnees!$G$2:$G$420)","v":{"v":21372.43,"d":"21,372.43 $"}},"classe0",0.6153594332772269,10,"Aube (10)",null,null,"","","","",null,"Allier11","Allier","Sucre",{"$f":"donnees!E11","v":{"v":2911.37,"d":"2,911 $"}},{"$f":"donnees!G11","v":{"v":2220.84,"d":"2,221 $"}}]
[11,"Aude",{"$f":"SUMIF(donnees!$B$2:$B$420,$B12,donnees!$F$2:$F$420)","v":{"v":21175.29,"d":"21,175.29 $"}},{"$f":"SUMIF(donnees!$B$2:$B$420,$B12,donnees!$G$2:$G$420)","v":{"v":16111.27,"d":"16,111.27 $"}},"classe1",0.7608523897429503,11,"Aude (11)",null,null,"","","","",null,"Allier12","Allier","Fromage",{"$f":"donnees!E12","v":{"v":4138.200000000001,"d":"4,138 $"}},{"$f":"donnees!G12","v":{"v":5570.400000000001,"d":"5,570 $"}}]
[12,"Aveyron",{"$f":"SUMIF(donnees!$B$2:$B$420,$B13,donnees!$F$2:$F$420)","v":{"v":10753.18,"d":"10,753.18 $"}},{"$f":"SUMIF(donnees!$B$2:$B$420,$B13,donnees!$G$2:$G$420)","v":{"v":8645.52,"d":"8,645.52 $"}},"classe1",0.8039965851961931,12,"Aveyron (12)",{"$nulls":3},"total",{"$f":"SUM(M8:M12)","v":0},{"$f":"SUM(N8:N12)","v":0},null,"Allier13","Allier","Yaourt",{"$f":"donnees!E13","v":{"v":561,"d":"561 $"}},{"$f":"donnees!G13","v":{"v":3267,"d":"3,267 $"}}]
[13,"Bouches-du-Rhône",{"$f":"SUMIF(donnees!$B$2:$B$420,$B14,donnees!$F$2:$F$420)","v":{"v":37246,"d":"37,246.00 $"}},{"$f":"SUMIF(donnees!$B$2:$B$420,$B14,donnees!$G$2:$G$420)","v":{"v":19259.23,"d":"19,259.23 $"}},"classe0",0.5170818342909306,13,"Bouches-du-Rhône (13)",null,{"$f":"IF(actDept=\"\",\"\",actDept &\": Répartion du CA en \" &N7)","v":""},{"$nulls":3},{"$f":"IFERROR(VLOOKUP(actDept,$B$2:$C$97,2,0),\"\")","v":""},null,"Allier14","Allier","Lait",{"$f":"donnees!E14","v":{"v":8595,"d":"8,595 $"}},{"$f":"donnees!G14","v":{"v":4230,"d":"4,230 $"}}]
[14,"Calvados",{"$f":"SUMIF(donnees!$B$2:$B$420,$B15,donnees!$F$2:$F$420)","v":{"v":15861,"d":"15,861.00 $"}},{"$f":"SUMIF(donnees!$B$2:$B$420,$B15,donnees!$G$2:$G$420)","v":{"v":16418,"d":"16,418.00 $"}},"classe3",1.0351175840110964,14,"Calvados (14)",null,{"$f":"IF(actDept=\"\",\"\",actDept &\": comparaison du CA\")","v":""},{"$nulls":5},"Allier15","Allier","Riz",{"$f":"donnees!E15","v":{"v":8217,"d":"8,217 $"}},{"$f":"donnees!G15","v":{"v":6072,"d":"6,072 $"}}]
{"$rows_left_out":405}