{"text_format":"3","workbook":"xlsx","n_sheets":9,"sheets":["TDB","depts","deptAvecNum","testDept","Config","calculTMB","donnees","nomRegions","nomDept"],"not_rendered":{"charts":5,"images":1,"macros":1,"defined_names":16},"read":"whole","date_system":"1900"}

{"sheet":"TDB","index":0,"n_rows":42,"n_cols":30,"rows_kept":42,"merged":[[1,1,2,6],[1,7,2,14],[2,23,2,24],[3,7,3,14],[3,23,5,24],[6,23,6,24],[8,16,8,25],[11,18,11,20],[11,21,11,23],[12,18,12,20],[12,21,12,23],[22,17,22,24],[23,18,23,24],[24,18,24,24],[25,18,25,24],[27,17,27,24],[28,18,28,24],[29,18,29,24],[30,1,30,6],[30,18,30,24],[32,17,32,24],[33,7,33,10],[33,18,33,24],[34,18,34,24],[35,18,35,24],[40,15,40,25],[41,15,41,25]]}
[{"$nulls":28},"q"]
[null,{"$f":"rappel","v":"France: résultats MCB 2015"},{"$nulls":5},"Excel1895: TABLEAU DE BORD ",{"$nulls":21},"http://www.lemonde.fr/carte-departements/"]
[{"$nulls":23},{"$f":"UPPER(TEXT(TODAY(),\"mmm\"))","v":"MARS"}]
[{"$nulls":7},"MCB: Résultats régionaux 2015",{"$nulls":15},{"$f":"UPPER(TEXT(TODAY(),\"j\"))","v":"11"}]
[]
[]
[{"$nulls":23},{"$f":"UPPER(TEXT(TODAY(),\"aaaa\"))","v":"2016"}]
[]
[{"$nulls":16},"Infos clés"]
[]
[{"$nulls":28},"44R","Alsace-Champagne-Ardenne-Lorraine"]
[{"$nulls":18},{"$f":"I36","v":2015},null,null,{"$f":"J36","v":2014},{"$nulls":6},"75R","Aquitaine-Limousin-Poitou-Charentes"]
[{"$nulls":17},"CA:",{"$f":"calculTMB!G19","v":{"v":3489416.96,"d":"3,489,417 €"}},null,null,{"$f":"calculTMB!H19","v":{"v":3296256.65,"d":"3,296,257 €"}},null,null,{"$f":"(S13-V13)/V13","v":{"v":0.05859989998048242,"d":"6%"}},{"$nulls":3},"84R","Auvergne-Rhône-Alpes"]
[{"$nulls":28},"27R","Bourgogne-Franche-Comté"]
[{"$nulls":28},"53R","Bretagne"]
[{"$nulls":28},"24R","Centre-Val de Loire"]
[{"$nulls":28},"94R","Corse"]
[{"$nulls":28},"11R","Île-de-France"]
[{"$nulls":28},"76R","Languedoc-Roussillon-Midi-Pyrénées"]
[{"$nulls":28},"32R","Nord-Pas-de-Calais-Picardie"]
[{"$nulls":28},"28R","Normandie"]
[{"$nulls":28},"52R","Pays de la Loire"]
[{"$nulls":17},"TOP 3 Régions (MCB)",{"$nulls":10},"93R","Provence-Alpes-Côte d'Azur"]
[{"$nulls":17},1,{"$f":"VLOOKUP(LARGE(nomRegions!$A$17:$A$29,ROW(nomRegions!A1)),nomRegions!$A$17:$B$29,2,0)","v":"Bretagne"}]
[{"$nulls":17},2,{"$f":"VLOOKUP(LARGE(nomRegions!$A$17:$A$29,ROW(nomRegions!A2)),nomRegions!$A$17:$B$29,2,0)","v":"Nord-Pas-de-Calais-Picardie"}]
[{"$nulls":17},3,{"$f":"VLOOKUP(LARGE(nomRegions!$A$17:$A$29,ROW(nomRegions!A3)),nomRegions!$A$17:$B$29,2,0)","v":"Auvergne-Rhône-Alpes"}]
[]
[{"$nulls":17},"TOP 3 Depts (MCB)"]
[{"$nulls":17},1,{"$f":"VLOOKUP(LARGE(nomDept!$F$2:$F$97,ROW(nomDept!A1)),nomDept!$F$2:$H$97,3,0)","v":"Haute-Marne (52)"}]
[{"$nulls":17},2,{"$f":"VLOOKUP(LARGE(nomDept!$F$2:$F$97,ROW(nomDept!A2)),nomDept!$F$2:$H$97,3,0)","v":"Drôme (26)"}]
[{"$nulls":17},3,{"$f":"VLOOKUP(LARGE(nomDept!$F$2:$F$97,ROW(nomDept!A3)),nomDept!$F$2:$H$97,3,0)","v":"Finistère (29)"}]
[]
[{"$nulls":17},"TOP 3 Produits (MCB)"]
[{"$nulls":7},{"$f":"nomRegions!J19&\": contribution à la MCB par produit\"","v":"France métropolitaine: contribution à la MCB par produit"},{"$nulls":9},1,{"$f":"VLOOKUP(LARGE(nomRegions!$M$35:$M$39,ROW(nomRegions!A1)),nomRegions!$M$35:$N$39,2,0)","v":"Riz"}]
[{"$nulls":17},2,{"$f":"VLOOKUP(LARGE(nomRegions!$M$35:$M$39,ROW(nomRegions!A2)),nomRegions!$M$35:$N$39,2,0)","v":"Lait"}]
[{"$nulls":8},{"$f":"nomRegions!M19","v":2015},{"$f":"nomRegions!L19","v":2014},{"$nulls":7},3,{"$f":"VLOOKUP(LARGE(nomRegions!$M$35:$M$39,ROW(nomRegions!A3)),nomRegions!$M$35:$N$39,2,0)","v":"Fromage"}]
[{"$nulls":7},{"$f":"nomRegions!K20","v":"Fromage"},{"$f":"nomRegions!M20","v":{"v":318894.60000000003,"d":"318,895 €"}},{"$f":"nomRegions!L20","v":{"v":300434.19999999984,"d":"300,434 €"}},{"$f":"IFERROR((I37-J37)/J37,\"\")","v":{"v":0.06144573420735791,"d":"6%"}}]
[{"$nulls":7},{"$f":"nomRegions!K21","v":"Lait"},{"$f":"nomRegions!M21","v":{"v":419412,"d":"419,412 €"}},{"$f":"nomRegions!L21","v":{"v":401805,"d":"401,805 €"}},{"$f":"IFERROR((I38-J38)/J38,\"\")","v":{"v":0.0438197633180274,"d":"4%"}}]
[{"$nulls":7},{"$f":"nomRegions!K22","v":"Riz"},{"$f":"nomRegions!M22","v":{"v":435645,"d":"435,645 €"}},{"$f":"nomRegions!L22","v":{"v":459363,"d":"459,363 €"}},{"v":-0.05163236917209266,"d":"-5%"}]
[{"$nulls":7},{"$f":"nomRegions!K23","v":"Sucre"},{"$f":"nomRegions!M23","v":{"v":291696.19000000006,"d":"291,696 €"}},{"$f":"nomRegions!L23","v":{"v":276365.23,"d":"276,365 €"}},{"v":0.05547354853575495,"d":"6%"}]
[{"$nulls":7},{"$f":"nomRegions!K24","v":"Yaourt"},{"$f":"nomRegions!M24","v":{"v":222696,"d":"222,696 €"}},{"$f":"nomRegions!L24","v":{"v":190107,"d":"190,107 €"}},{"v":0.1714245135634143,"d":"17%"},{"$nulls":4},"powered by excel1895. Tous droits réservés ©"]
[{"$nulls":7},"Total",{"$f":"nomRegions!M25","v":{"v":1688343.79,"d":"1,688,344 €"}},{"$f":"nomRegions!L25","v":{"v":1628074.4299999997,"d":"1,628,074 €"}},{"v":0.03701879895011947,"d":"4%"},{"$nulls":4},"contact: seye.cak@gmail.com"]

{"sheet":"depts","index":1,"n_rows":0,"n_cols":0,"rows_kept":0,"hidden":true}

{"sheet":"deptAvecNum","index":2,"n_rows":0,"n_cols":0,"rows_kept":0,"hidden":true}

{"sheet":"testDept","index":3,"n_rows":0,"n_cols":0,"rows_kept":0,"hidden":true}

{"sheet":"Config","index":4,"n_rows":5,"n_cols":10,"rows_kept":5}
[]
[{"$nulls":6},{"v":0,"d":"0%"},"<75%",null,"classe0"]
[{"$nulls":6},{"v":0.75,"d":"75%"},"75% et < 85%",null,"classe1"]
[{"$nulls":6},{"v":0.85,"d":"85%"},"85% et < 100%",null,"classe2"]
[{"$nulls":6},{"v":1.01,"d":"101%"},">101%",null,"classe3"]

{"sheet":"calculTMB","index":5,"n_rows":42,"n_cols":12,"rows_kept":42,"hidden":true,"merged":[[8,0,8,4]]}
[{"$nulls":7},"Bretagne"]
[{"$nulls":8},"nomRegion","2011","2012","rang"]
[{"$nulls":8},"Corse",1701,1430,{"$f":"IF($H$1=I3,K3,\"\")","v":""}]
["grapheD",2012,2011,{"$nulls":5},"Normandie",2255,2336,{"$f":"IF($H$1=I4,K4,\"\")","v":""}]
["MCB",{"$f":"SUM(donnees!$G$2:$G$420)","v":1688343.7900000007},{"$f":"SUM(donnees!$E$2:$E$420)","v":1628074.430000001},{"$nulls":5},"Provence-Alpes-Côte d'Azur",3134,3121,""]
["CT",{"$f":"SUM(donnees!$L$2:$L$420)","v":1773988.0999999999},{"$f":"SUM(donnees!$K$2:$K$420)","v":1710086.7999999996},{"$nulls":5},"Pays de la Loire",1811,3363,""]
["TMB",{"$f":"B5/B6","v":{"v":0.9517221620595995,"d":"95.17%"}},{"$f":"C5/C6","v":{"v":0.9520419840677102,"d":"95.20%"}},{"$f":"((C5*1.25)/C6*1.1)","v":{"v":1.3090577280931015,"d":"131%"}},{"$nulls":4},"Bretagne",1407,3412,3412]
[{"$nulls":8},"Centre-Val de Loire",1844,3770,""]
["top 5 des produits les plus vendus dans la région (Dept)",{"$nulls":7},"Nord-Pas-de-Calais-Picardie",1942,4167,""]
["France",2012,2011,{"$nulls":5},"Île-de-France",3956,5357,""]
["Fromage",{"$f":"SUMIF(donnees!$D:$D,calculTMB!$A11,donnees!$J:$J)","v":144857},{"$f":"SUMIF(donnees!$D:$D,calculTMB!$A11,donnees!$H:$H)","v":136561},"Fromage",{"v":3,"d":"3.00 €"},{"$nulls":3},"Bourgogne-Franche-Comté",3172,6838,""]
["Lait",{"$f":"SUMIF(donnees!$D:$D,calculTMB!$A12,donnees!$J:$J)","v":139804},{"$f":"SUMIF(donnees!$D:$D,calculTMB!$A12,donnees!$H:$H)","v":133935},"Lait",{"v":3.99,"d":"3.99 €"},{"$nulls":3},"Auvergne-Rhône-Alpes",4950,7487,""]
["Riz",{"$f":"SUMIF(donnees!$D:$D,calculTMB!$A13,donnees!$J:$J)","v":145215},{"$f":"SUMIF(donnees!$D:$D,calculTMB!$A13,donnees!$H:$H)","v":153121},"Riz",{"v":4.5,"d":"4.50 €"},{"$nulls":3},"Alsace-Champagne-Ardenne-Lorraine",4854,7499,""]
["Sucre",{"$f":"SUMIF(donnees!$D:$D,calculTMB!$A14,donnees!$J:$J)","v":146581},{"$f":"SUMIF(donnees!$D:$D,calculTMB!$A14,donnees!$H:$H)","v":138877},"Sucre",{"v":6.5,"d":"6.50 €"},{"$nulls":3},"Languedoc-Roussillon-Midi-Pyrénées",5642,8216,""]
["Yaourt",{"$f":"SUMIF(donnees!$D:$D,calculTMB!$A15,donnees!$J:$J)","v":148464},{"$f":"SUMIF(donnees!$D:$D,calculTMB!$A15,donnees!$H:$H)","v":126738},"Yaourt",{"v":6,"d":"6.00 €"},{"$nulls":3},"Aquitaine-Limousin-Poitou-Charentes",5486,8890,""]
[]
[" Dept",2012,2011]
["Fromage",{"$f":"SUMIFS(donnees!$J:$J,donnees!$B:$B,calculTMB!$A$23,donnees!$D:$D,calculTMB!$A18)","v":0},{"$f":"SUMIFS(donnees!$H:$H,donnees!$B:$B,calculTMB!$A$23,donnees!$D:$D,calculTMB!$A18)","v":0},{"$nulls":3},2012,2011]
["Lait",{"$f":"SUMIFS(donnees!$J:$J,donnees!$B:$B,calculTMB!$A$23,donnees!$D:$D,calculTMB!$A19)","v":0},{"$f":"SUMIFS(donnees!$H:$H,donnees!$B:$B,calculTMB!$A$23,donnees!$D:$D,calculTMB!$A19)","v":0},null,null,"CA global",{"$f":"SUMPRODUCT(B11:B15,E11:E15)","v":3489416.96},{"$f":"SUMPRODUCT(C11:C15,E11:E15)","v":3296256.65},{"$f":"(G19-H19)/H19","v":{"v":0.05859989998048242,"d":"6%"}}]
["Riz",{"$f":"SUMIFS(donnees!$J:$J,donnees!$B:$B,calculTMB!$A$23,donnees!$D:$D,calculTMB!$A20)","v":0},{"$f":"SUMIFS(donnees!$H:$H,donnees!$B:$B,calculTMB!$A$23,donnees!$D:$D,calculTMB!$A20)","v":0}]
["Sucre",{"$f":"SUMIFS(donnees!$J:$J,donnees!$B:$B,calculTMB!$A$23,donnees!$D:$D,calculTMB!$A21)","v":0},{"$f":"SUMIFS(donnees!$H:$H,donnees!$B:$B,calculTMB!$A$23,donnees!$D:$D,calculTMB!$A21)","v":0}]
["Yaourt",{"$f":"SUMIFS(donnees!$J:$J,donnees!$B:$B,calculTMB!$A$23,donnees!$D:$D,calculTMB!$A22)","v":0},{"$f":"SUMIFS(donnees!$H:$H,donnees!$B:$B,calculTMB!$A$23,donnees!$D:$D,calculTMB!$A22)","v":0}]
[{"$f":"actDept","v":""}]
[]
["Region",2012,2011]
["Fromage",{"$f":"SUMIFS(donnees!$J:$J,donnees!$C:$C,calculTMB!$A$31,donnees!$D:$D,calculTMB!$A26)","v":20932},{"$f":"SUMIFS(donnees!$H:$H,donnees!$C:$C,calculTMB!$A$31,donnees!$D:$D,calculTMB!$A26)","v":22203}]
["Lait",{"$f":"SUMIFS(donnees!$J:$J,donnees!$C:$C,calculTMB!$A$31,donnees!$D:$D,calculTMB!$A27)","v":20849},{"$f":"SUMIFS(donnees!$H:$H,donnees!$C:$C,calculTMB!$A$31,donnees!$D:$D,calculTMB!$A27)","v":17374}]
["Riz",{"$f":"SUMIFS(donnees!$J:$J,donnees!$C:$C,calculTMB!$A$31,donnees!$D:$D,calculTMB!$A28)","v":19594},{"$f":"SUMIFS(donnees!$H:$H,donnees!$C:$C,calculTMB!$A$31,donnees!$D:$D,calculTMB!$A28)","v":18523}]
["Sucre",{"$f":"SUMIFS(donnees!$J:$J,donnees!$C:$C,calculTMB!$A$31,donnees!$D:$D,calculTMB!$A29)","v":21067},{"$f":"SUMIFS(donnees!$H:$H,donnees!$C:$C,calculTMB!$A$31,donnees!$D:$D,calculTMB!$A29)","v":20515}]
["Yaourt",{"$f":"SUMIFS(donnees!$J:$J,donnees!$C:$C,calculTMB!$A$31,donnees!$D:$D,calculTMB!$A30)","v":22690},{"$f":"SUMIFS(donnees!$H:$H,donnees!$C:$C,calculTMB!$A$31,donnees!$D:$D,calculTMB!$A30)","v":18886}]
[{"$f":"actRegion","v":"Languedoc-Roussillon-Midi-Pyrénées"}]
[]
[]
[]
["grapheE",2012,2011]
["Fromage",{"$f":"IF(typeD=\"R\",calculTMB!B26,IF(typeD=\"D\",calculTMB!B18,calculTMB!B11))","v":144857},{"$f":"IF(typeD=\"R\",calculTMB!C26,IF(typeD=\"D\",calculTMB!C18,calculTMB!C11))","v":136561}]
["Lait",{"$f":"IF(typeD=\"R\",calculTMB!B27,IF(typeD=\"D\",calculTMB!B19,calculTMB!B12))","v":139804},{"$f":"IF(typeD=\"R\",calculTMB!C27,IF(typeD=\"D\",calculTMB!C19,calculTMB!C12))","v":133935}]
["Riz",{"$f":"IF(typeD=\"R\",calculTMB!B28,IF(typeD=\"D\",calculTMB!B20,calculTMB!B13))","v":145215},{"$f":"IF(typeD=\"R\",calculTMB!C28,IF(typeD=\"D\",calculTMB!C20,calculTMB!C13))","v":153121}]
["Sucre",{"$f":"IF(typeD=\"R\",calculTMB!B29,IF(typeD=\"D\",calculTMB!B21,calculTMB!B14))","v":146581},{"$f":"IF(typeD=\"R\",calculTMB!C29,IF(typeD=\"D\",calculTMB!C21,calculTMB!C14))","v":138877}]
["Yaourt",{"$f":"IF(typeD=\"R\",calculTMB!B30,IF(typeD=\"D\",calculTMB!B22,calculTMB!B15))","v":148464},{"$f":"IF(typeD=\"R\",calculTMB!C30,IF(typeD=\"D\",calculTMB!C22,calculTMB!C15))","v":126738}]
[]
["tireGraphe",{"$f":"nomRegions!J19&\": Qtés vendues par produit\"","v":"France métropolitaine: Qtés vendues par produit"}]

{"sheet":"donnees","index":6,"n_rows":420,"n_cols":19,"rows_kept":420}
["numDept","nomDept","nomReg","nomProd","MCB_2014","MCB_Cible_2015","MCB_2015","QteV_2014","QteCible","QteV_2015","CT_2014","CT_2015",{"$nulls":4},"nomProduit","coutProd","prixProd"]
[1,"Ain","Auvergne-Rhône-Alpes","Fromage",{"$f":"H2*VLOOKUP($D2,$Q$2:$S$6,3,0)-K2","v":{"v":2730.2000000000003,"d":"2,730 $"}},{"$f":"I2*VLOOKUP($D2,$Q$2:$S$6,3,0)-I2*VLOOKUP($D2,$Q$2:$S$6,2,0)","v":{"v":3275.8,"d":"3,276 $"}},{"$f":"J2*VLOOKUP($D2,$Q$2:$S$6,3,0)-L2","v":{"v":4928,"d":"4,928 $"}},1241,{"$f":"INT(H2*1.2)","v":1489},2240,{"$f":"H2*VLOOKUP($D2,$Q$2:$S$6,2,0)","v":{"v":2854.2999999999997,"d":"2,854 $"}},{"$f":"J2*VLOOKUP($D2,$Q$2:$S$6,2,0)","v":{"v":5152,"d":"5,152 $"}},{"$nulls":4},"Yaourt",{"v":1.5,"d":"1.50 €"},{"v":3,"d":"3.00 €"}]
[1,"Ain","Auvergne-Rhône-Alpes","Lait",{"$f":"H3*VLOOKUP($D3,$Q$2:$S$6,3,0)-K3","v":{"v":4743,"d":"4,743 $"}},{"$f":"I3*VLOOKUP($D3,$Q$2:$S$6,3,0)-I3*VLOOKUP($D3,$Q$2:$S$6,2,0)","v":{"v":5691,"d":"5,691 $"}},{"$f":"J3*VLOOKUP($D3,$Q$2:$S$6,3,0)-L3","v":{"v":3996,"d":"3,996 $"}},1581,{"$f":"INT(H3*1.2)","v":1897},1332,{"$f":"H3*VLOOKUP($D3,$Q$2:$S$6,2,0)","v":{"v":5533.5,"d":"5,534 $"}},{"$f":"J3*VLOOKUP($D3,$Q$2:$S$6,2,0)","v":{"v":4662,"d":"4,662 $"}},{"$nulls":4},"Sucre",{"v":2,"d":"2.00 €"},{"v":3.99,"d":"3.99 €"}]
[1,"Ain","Auvergne-Rhône-Alpes","Sucre",{"v":7960,"d":"7,960 $"},{"v":9552,"d":"9,552 $"},{"$f":"J4*VLOOKUP($D4,$Q$2:$S$6,3,0)-L4","v":{"v":4230.74,"d":"4,231 $"}},4000,4800,2126,{"v":8000,"d":"8,000 $"},{"v":4252,"d":"4,252 $"},{"$nulls":4},"Fromage",{"v":2.3,"d":"2.30 €"},{"v":4.5,"d":"4.50 €"}]
[1,"Ain","Auvergne-Rhône-Alpes","Riz",{"v":6294,"d":"6,294 $"},{"v":7551,"d":"7,551 $"},{"v":6750,"d":"6,750 $"},2098,2517,2250,{"v":6294,"d":"6,294 $"},{"v":6750,"d":"6,750 $"},{"$nulls":4},"Lait",{"v":3.5,"d":"3.50 €"},{"v":6.5,"d":"6.50 €"}]
[1,"Ain","Auvergne-Rhône-Alpes","Yaourt",{"v":3601.5,"d":"3,602 $"},{"v":4321.5,"d":"4,322 $"},{"v":2730,"d":"2,730 $"},2401,2881,1820,{"v":3601.5,"d":"3,602 $"},{"v":2730,"d":"2,730 $"},{"$nulls":4},"Riz",{"v":3,"d":"3.00 €"},{"v":6,"d":"6.00 €"}]
[2,"Aisne","Nord-Pas-de-Calais-Picardie","Riz",{"v":7086,"d":"7,086 $"},{"v":8502,"d":"8,502 $"},{"v":4116,"d":"4,116 $"},2362,2834,1372,{"v":7086,"d":"7,086 $"},{"v":4116,"d":"4,116 $"}]
[2,"Aisne","Nord-Pas-de-Calais-Picardie","Fromage",{"v":2415.6000000000004,"d":"2,416 $"},{"v":2897.4,"d":"2,897 $"},{"v":2499.2000000000003,"d":"2,499 $"},1098,1317,1136,{"v":2525.3999999999996,"d":"2,525 $"},{"v":2612.7999999999997,"d":"2,613 $"}]
[2,"Aisne","Nord-Pas-de-Calais-Picardie","Sucre",{"v":5012.810000000001,"d":"5,013 $"},{"v":6013.780000000001,"d":"6,014 $"},{"v":3223.8,"d":"3,224 $"},2519,3022,1620,{"v":5038,"d":"5,038 $"},{"v":3240,"d":"3,240 $"}]
[2,"Aisne","Nord-Pas-de-Calais-Picardie","Yaourt",{"v":360,"d":"360 $"},{"v":432,"d":"432 $"},{"v":2383.5,"d":"2,384 $"},240,288,1589,{"v":360,"d":"360 $"},{"v":2383.5,"d":"2,384 $"}]
[3,"Allier","Auvergne-Rhône-Alpes","Sucre",{"v":2911.37,"d":"2,911 $"},{"v":3492.4500000000007,"d":"3,492 $"},{"v":2220.84,"d":"2,221 $"},1463,1755,1116,{"v":2926,"d":"2,926 $"},{"v":2232,"d":"2,232 $"}]
[3,"Allier","Auvergne-Rhône-Alpes","Fromage",{"v":4138.200000000001,"d":"4,138 $"},{"v":4965.400000000001,"d":"4,965 $"},{"v":5570.400000000001,"d":"5,570 $"},1881,2257,2532,{"v":4326.299999999999,"d":"4,326 $"},{"v":5823.599999999999,"d":"5,824 $"}]
[3,"Allier","Auvergne-Rhône-Alpes","Yaourt",{"v":561,"d":"561 $"},{"v":672,"d":"672 $"},{"v":3267,"d":"3,267 $"},374,448,2178,{"v":561,"d":"561 $"},{"v":3267,"d":"3,267 $"}]
[3,"Allier","Auvergne-Rhône-Alpes","Lait",{"v":8595,"d":"8,595 $"},{"v":10314,"d":"10,314 $"},{"v":4230,"d":"4,230 $"},2865,3438,1410,{"v":10027.5,"d":"10,028 $"},{"v":4935,"d":"4,935 $"}]
[3,"Allier","Auvergne-Rhône-Alpes","Riz",{"v":8217,"d":"8,217 $"},{"v":9858,"d":"9,858 $"},{"v":6072,"d":"6,072 $"},2739,3286,2024,{"v":8217,"d":"8,217 $"},{"v":6072,"d":"6,072 $"}]
[4,"Alpes-de-Haute-Provence","Provence-Alpes-Côte d'Azur","Riz",{"v":7941,"d":"7,941 $"},{"v":9528,"d":"9,528 $"},{"v":4590,"d":"4,590 $"},2647,3176,1530,{"v":7941,"d":"7,941 $"},{"v":4590,"d":"4,590 $"}]
[4,"Alpes-de-Haute-Provence","Provence-Alpes-Côte d'Azur","Lait",{"v":6306,"d":"6,306 $"},{"v":7566,"d":"7,566 $"},{"v":3003,"d":"3,003 $"},2102,2522,1001,{"v":7357,"d":"7,357 $"},{"v":3503.5,"d":"3,504 $"}]
[4,"Alpes-de-Haute-Provence","Provence-Alpes-Côte d'Azur","Sucre",{"v":1635.7800000000002,"d":"1,636 $"},{"v":1962.1400000000003,"d":"1,962 $"},{"v":1890.5,"d":"1,891 $"},822,986,950,{"v":1644,"d":"1,644 $"},{"v":1900,"d":"1,900 $"}]
[4,"Alpes-de-Haute-Provence","Provence-Alpes-Côte d'Azur","Fromage",{"v":5504.400000000001,"d":"5,504 $"},{"v":6604.400000000001,"d":"6,604 $"},{"v":4188.8,"d":"4,189 $"},2502,3002,1904,{"v":5754.599999999999,"d":"5,755 $"},{"v":4379.2,"d":"4,379 $"}]
[6,"Alpes-Maritimes","Provence-Alpes-Côte d'Azur","Fromage",{"v":5090.8,"d":"5,091 $"},{"v":6107.200000000001,"d":"6,107 $"},{"v":2182.4,"d":"2,182 $"},2314,2776,992,{"v":5322.2,"d":"5,322 $"},{"v":2281.6,"d":"2,282 $"}]
[6,"Alpes-Maritimes","Provence-Alpes-Côte d'Azur","Sucre",{"v":5771,"d":"5,771 $"},{"v":6925.200000000001,"d":"6,925 $"},{"v":2423.8200000000006,"d":"2,424 $"},2900,3480,1218,{"v":5800,"d":"5,800 $"},{"v":2436,"d":"2,436 $"}]
[6,"Alpes-Maritimes","Provence-Alpes-Côte d'Azur","Riz",{"v":4755,"d":"4,755 $"},{"v":5706,"d":"5,706 $"},{"v":5484,"d":"5,484 $"},1585,1902,1828,{"v":4755,"d":"4,755 $"},{"v":5484,"d":"5,484 $"}]
[6,"Alpes-Maritimes","Provence-Alpes-Côte d'Azur","Yaourt",{"v":3687,"d":"3,687 $"},{"v":4423.5,"d":"4,424 $"},{"v":3756,"d":"3,756 $"},2458,2949,2504,{"v":3687,"d":"3,687 $"},{"v":3756,"d":"3,756 $"}]
[7,"Ardèche","Auvergne-Rhône-Alpes","Yaourt",{"v":1216.5,"d":"1,217 $"},{"v":1459.5,"d":"1,460 $"},{"v":2409,"d":"2,409 $"},811,973,1606,{"v":1216.5,"d":"1,217 $"},{"v":2409,"d":"2,409 $"}]
[7,"Ardèche","Auvergne-Rhône-Alpes","Fromage",{"v":1742.4,"d":"1,742 $"},{"v":2090,"d":"2,090 $"},{"v":5440.6,"d":"5,441 $"},792,950,2473,{"v":1821.6,"d":"1,822 $"},{"v":5687.9,"d":"5,688 $"}]
[7,"Ardèche","Auvergne-Rhône-Alpes","Lait",{"v":900,"d":"900 $"},{"v":1080,"d":"1,080 $"},{"v":6264,"d":"6,264 $"},300,360,2088,{"v":1050,"d":"1,050 $"},{"v":7308,"d":"7,308 $"}]
[7,"Ardèche","Auvergne-Rhône-Alpes","Riz",{"v":5262,"d":"5,262 $"},{"v":6312,"d":"6,312 $"},{"v":7077,"d":"7,077 $"},1754,2104,2359,{"v":5262,"d":"5,262 $"},{"v":7077,"d":"7,077 $"}]
[7,"Ardèche","Auvergne-Rhône-Alpes","Sucre",{"v":6346.110000000001,"d":"6,346 $"},{"v":7613.740000000002,"d":"7,614 $"},{"v":1791,"d":"1,791 $"},3189,3826,900,{"v":6378,"d":"6,378 $"},{"v":1800,"d":"1,800 $"}]
[8,"Ardennes","Alsace-Champagne-Ardenne-Lorraine","Riz",{"v":9975,"d":"9,975 $"},{"v":11970,"d":"11,970 $"},{"v":3048,"d":"3,048 $"},3325,3990,1016,{"v":9975,"d":"9,975 $"},{"v":3048,"d":"3,048 $"}]
[8,"Ardennes","Alsace-Champagne-Ardenne-Lorraine","Fromage",{"v":3920.4000000000005,"d":"3,920 $"},{"v":4703.6,"d":"4,704 $"},{"v":3269.2000000000003,"d":"3,269 $"},1782,2138,1486,{"v":4098.599999999999,"d":"4,099 $"},{"v":3417.7999999999997,"d":"3,418 $"}]
[8,"Ardennes","Alsace-Champagne-Ardenne-Lorraine","Yaourt",{"v":3928.5,"d":"3,929 $"},{"v":4713,"d":"4,713 $"},{"v":1780.5,"d":"1,781 $"},2619,3142,1187,{"v":3928.5,"d":"3,929 $"},{"v":1780.5,"d":"1,781 $"}]
[8,"Ardennes","Alsace-Champagne-Ardenne-Lorraine","Lait",{"v":6435,"d":"6,435 $"},{"v":7722,"d":"7,722 $"},{"v":4836,"d":"4,836 $"},2145,2574,1612,{"v":7507.5,"d":"7,508 $"},{"v":5642,"d":"5,642 $"}]
[9,"Ariège","Languedoc-Roussillon-Midi-Pyrénées","Riz",{"v":6081,"d":"6,081 $"},{"v":7296,"d":"7,296 $"},{"v":4518,"d":"4,518 $"},2027,2432,1506,{"v":6081,"d":"6,081 $"},{"v":4518,"d":"4,518 $"}]
[9,"Ariège","Languedoc-Roussillon-Midi-Pyrénées","Lait",{"v":7461,"d":"7,461 $"},{"v":8952,"d":"8,952 $"},{"v":3294,"d":"3,294 $"},2487,2984,1098,{"v":8704.5,"d":"8,705 $"},{"v":3843,"d":"3,843 $"}]
[9,"Ariège","Languedoc-Roussillon-Midi-Pyrénées","Sucre",{"v":465.6600000000001,"d":"466 $"},{"v":557.2,"d":"557 $"},{"v":2495.46,"d":"2,495 $"},234,280,1254,{"v":468,"d":"468 $"},{"v":2508,"d":"2,508 $"}]
[9,"Ariège","Languedoc-Roussillon-Midi-Pyrénées","Yaourt",{"v":1129.5,"d":"1,130 $"},{"v":1354.5,"d":"1,355 $"},{"v":3946.5,"d":"3,947 $"},753,903,2631,{"v":1129.5,"d":"1,130 $"},{"v":3946.5,"d":"3,947 $"}]
[9,"Ariège","Languedoc-Roussillon-Midi-Pyrénées","Fromage",{"v":2391.4,"d":"2,391 $"},{"v":2868.8,"d":"2,869 $"},{"v":4914.8,"d":"4,915 $"},1087,1304,2234,{"v":2500.1,"d":"2,500 $"},{"v":5138.2,"d":"5,138 $"}]
[10,"Aube","Alsace-Champagne-Ardenne-Lorraine","Lait",{"v":11343,"d":"11,343 $"},{"v":13611,"d":"13,611 $"},{"v":3255,"d":"3,255 $"},3781,4537,1085,{"v":13233.5,"d":"13,234 $"},{"v":3797.5,"d":"3,798 $"}]
[10,"Aube","Alsace-Champagne-Ardenne-Lorraine","Yaourt",{"v":4311,"d":"4,311 $"},{"v":5172,"d":"5,172 $"},{"v":2416.5,"d":"2,417 $"},2874,3448,1611,{"v":4311,"d":"4,311 $"},{"v":2416.5,"d":"2,417 $"}]
[10,"Aube","Alsace-Champagne-Ardenne-Lorraine","Riz",{"v":9327,"d":"9,327 $"},{"v":11190,"d":"11,190 $"},{"v":7704,"d":"7,704 $"},3109,3730,2568,{"v":9327,"d":"9,327 $"},{"v":7704,"d":"7,704 $"}]
[10,"Aube","Alsace-Champagne-Ardenne-Lorraine","Fromage",{"v":2211,"d":"2,211 $"},{"v":2653.2000000000003,"d":"2,653 $"},{"v":3326.4,"d":"3,326 $"},1005,1206,1512,{"v":2311.5,"d":"2,312 $"},{"v":3477.6,"d":"3,478 $"}]
[10,"Aube","Alsace-Champagne-Ardenne-Lorraine","Sucre",{"v":1755.1800000000003,"d":"1,755 $"},{"v":2105.42,"d":"2,105 $"},{"v":4670.530000000001,"d":"4,671 $"},882,1058,2347,{"v":1764,"d":"1,764 $"},{"v":4694,"d":"4,694 $"}]
[11,"Aude","Languedoc-Roussillon-Midi-Pyrénées","Fromage",{"v":6472.400000000001,"d":"6,472 $"},{"v":7766.000000000001,"d":"7,766 $"},{"v":2085.6000000000004,"d":"2,086 $"},2942,3530,948,{"v":6766.599999999999,"d":"6,767 $"},{"v":2180.3999999999996,"d":"2,180 $"}]
[11,"Aude","Languedoc-Roussillon-Midi-Pyrénées","Sucre",{"v":4927.24,"d":"4,927 $"},{"v":5912.290000000001,"d":"5,912 $"},{"v":2652.67,"d":"2,653 $"},2476,2971,1333,{"v":4952,"d":"4,952 $"},{"v":2666,"d":"2,666 $"}]
[11,"Aude","Languedoc-Roussillon-Midi-Pyrénées","Yaourt",{"v":1438.5,"d":"1,439 $"},{"v":1725,"d":"1,725 $"},{"v":3984,"d":"3,984 $"},959,1150,2656,{"v":1438.5,"d":"1,439 $"},{"v":3984,"d":"3,984 $"}]
[11,"Aude","Languedoc-Roussillon-Midi-Pyrénées","Riz",{"v":4812,"d":"4,812 $"},{"v":5772,"d":"5,772 $"},{"v":7389,"d":"7,389 $"},1604,1924,2463,{"v":4812,"d":"4,812 $"},{"v":7389,"d":"7,389 $"}]
[12,"Aveyron","Languedoc-Roussillon-Midi-Pyrénées","Sucre",{"v":3651.6500000000005,"d":"3,652 $"},{"v":4381.98,"d":"4,382 $"},{"v":4632.720000000001,"d":"4,633 $"},1835,2202,2328,{"v":3670,"d":"3,670 $"},{"v":4656,"d":"4,656 $"}]
[12,"Aveyron","Languedoc-Roussillon-Midi-Pyrénées","Fromage",{"v":5310.8,"d":"5,311 $"},{"v":6371.200000000001,"d":"6,371 $"},{"v":4012.8,"d":"4,013 $"},2414,2896,1824,{"v":5552.2,"d":"5,552 $"},{"v":4195.2,"d":"4,195 $"}]
[67,"Bas-Rhin","Alsace-Champagne-Ardenne-Lorraine","Riz",{"v":6132,"d":"6,132 $"},{"v":7356,"d":"7,356 $"},{"v":7110,"d":"7,110 $"},2044,2452,2370,{"v":6132,"d":"6,132 $"},{"v":7110,"d":"7,110 $"}]
[67,"Bas-Rhin","Alsace-Champagne-Ardenne-Lorraine","Lait",{"v":5241,"d":"5,241 $"},{"v":6288,"d":"6,288 $"},{"v":5346,"d":"5,346 $"},1747,2096,1782,{"v":6114.5,"d":"6,115 $"},{"v":6237,"d":"6,237 $"}]
[67,"Bas-Rhin","Alsace-Champagne-Ardenne-Lorraine","Fromage",{"v":2945.8,"d":"2,946 $"},{"v":3533.2000000000003,"d":"3,533 $"},{"v":2380.4,"d":"2,380 $"},1339,1606,1082,{"v":3079.7,"d":"3,080 $"},{"v":2488.6,"d":"2,489 $"}]
[67,"Bas-Rhin","Alsace-Champagne-Ardenne-Lorraine","Yaourt",{"v":124.5,"d":"125 $"},{"v":148.5,"d":"149 $"},{"v":2239.5,"d":"2,240 $"},83,99,1493,{"v":124.5,"d":"125 $"},{"v":2239.5,"d":"2,240 $"}]
[67,"Bas-Rhin","Alsace-Champagne-Ardenne-Lorraine","Sucre",{"v":262.68000000000006,"d":"263 $"},{"v":314.4200000000001,"d":"314 $"},{"v":3259.620000000001,"d":"3,260 $"},132,158,1638,{"v":264,"d":"264 $"},{"v":3276,"d":"3,276 $"}]
[13,"Bouches-du-Rhône","Provence-Alpes-Côte d'Azur","Riz",{"v":8139,"d":"8,139 $"},{"v":9765,"d":"9,765 $"},{"v":4614,"d":"4,614 $"},2713,3255,1538,{"v":8139,"d":"8,139 $"},{"v":4614,"d":"4,614 $"}]
[13,"Bouches-du-Rhône","Provence-Alpes-Côte d'Azur","Yaourt",{"v":2923.5,"d":"2,924 $"},{"v":3507,"d":"3,507 $"},{"v":3408,"d":"3,408 $"},1949,2338,2272,{"v":2923.5,"d":"2,924 $"},{"v":3408,"d":"3,408 $"}]
[13,"Bouches-du-Rhône","Provence-Alpes-Côte d'Azur","Fromage",{"v":6085.200000000001,"d":"6,085 $"},{"v":7301.8,"d":"7,302 $"},{"v":2805,"d":"2,805 $"},2766,3319,1275,{"v":6361.799999999999,"d":"6,362 $"},{"v":2932.5,"d":"2,933 $"}]
[13,"Bouches-du-Rhône","Provence-Alpes-Côte d'Azur","Lait",{"v":7626,"d":"7,626 $"},{"v":9150,"d":"9,150 $"},{"v":6090,"d":"6,090 $"},2542,3050,2030,{"v":8897,"d":"8,897 $"},{"v":7105,"d":"7,105 $"}]
[13,"Bouches-du-Rhône","Provence-Alpes-Côte d'Azur","Sucre",{"v":6268.5,"d":"6,269 $"},{"v":7522.200000000001,"d":"7,522 $"},{"v":2342.2300000000005,"d":"2,342 $"},3150,3780,1177,{"v":6300,"d":"6,300 $"},{"v":2354,"d":"2,354 $"}]
[14,"Calvados","Normandie","Lait",{"v":4671,"d":"4,671 $"},{"v":5604,"d":"5,604 $"},{"v":3213,"d":"3,213 $"},1557,1868,1071,{"v":5449.5,"d":"5,450 $"},{"v":3748.5,"d":"3,749 $"}]
[14,"Calvados","Normandie","Fromage",{"v":3740.0000000000005,"d":"3,740 $"},{"v":4488,"d":"4,488 $"},{"v":2354,"d":"2,354 $"},1700,2040,1070,{"v":3909.9999999999995,"d":"3,910 $"},{"v":2461,"d":"2,461 $"}]
[14,"Calvados","Normandie","Riz",{"v":4101,"d":"4,101 $"},{"v":4920,"d":"4,920 $"},{"v":7788,"d":"7,788 $"},1367,1640,2596,{"v":4101,"d":"4,101 $"},{"v":7788,"d":"7,788 $"}]
[14,"Calvados","Normandie","Yaourt",{"v":708,"d":"708 $"},{"v":849,"d":"849 $"},{"v":3063,"d":"3,063 $"},472,566,2042,{"v":708,"d":"708 $"},{"v":3063,"d":"3,063 $"}]
[15,"Cantal","Auvergne-Rhône-Alpes","Riz",{"v":5970,"d":"5,970 $"},{"v":7164,"d":"7,164 $"},{"v":2739,"d":"2,739 $"},1990,2388,913,{"v":5970,"d":"5,970 $"},{"v":2739,"d":"2,739 $"}]
[15,"Cantal","Auvergne-Rhône-Alpes","Fromage",{"v":3308.8,"d":"3,309 $"},{"v":3968.8,"d":"3,969 $"},{"v":4408.8,"d":"4,409 $"},1504,1804,2004,{"v":3459.2,"d":"3,459 $"},{"v":4609.2,"d":"4,609 $"}]
[15,"Cantal","Auvergne-Rhône-Alpes","Yaourt",{"v":4020,"d":"4,020 $"},{"v":4824,"d":"4,824 $"},{"v":1248,"d":"1,248 $"},2680,3216,832,{"v":4020,"d":"4,020 $"},{"v":1248,"d":"1,248 $"}]
[15,"Cantal","Auvergne-Rhône-Alpes","Lait",{"v":4449,"d":"4,449 $"},{"v":5337,"d":"5,337 $"},{"v":4224,"d":"4,224 $"},1483,1779,1408,{"v":5190.5,"d":"5,191 $"},{"v":4928,"d":"4,928 $"}]
[16,"Charente","Aquitaine-Limousin-Poitou-Charentes","Sucre",{"$f":"H67*VLOOKUP($D67,$Q$2:$S$6,3,0)-K67","v":{"v":284.57000000000005,"d":"285 $"}},{"$f":"I67*VLOOKUP($D67,$Q$2:$S$6,3,0)-I67*VLOOKUP($D67,$Q$2:$S$6,2,0)","v":{"v":340.2900000000001,"d":"340 $"}},{"$f":"J67*VLOOKUP($D67,$Q$2:$S$6,3,0)-L67","v":{"v":3667.5700000000006,"d":"3,668 $"}},143,{"$f":"INT(H67*1.2)","v":171},1843,{"$f":"H67*VLOOKUP($D67,$Q$2:$S$6,2,0)","v":{"v":286,"d":"286 $"}},{"$f":"J67*VLOOKUP($D67,$Q$2:$S$6,2,0)","v":{"v":3686,"d":"3,686 $"}}]
[16,"Charente","Aquitaine-Limousin-Poitou-Charentes","Fromage",{"v":517,"d":"517 $"},{"v":620.4000000000001,"d":"620 $"},{"v":2415.6000000000004,"d":"2,416 $"},235,282,1098,{"v":540.5,"d":"541 $"},{"v":2525.3999999999996,"d":"2,525 $"}]
[16,"Charente","Aquitaine-Limousin-Poitou-Charentes","Yaourt",{"v":556.5,"d":"557 $"},{"v":667.5,"d":"668 $"},{"v":2812.5,"d":"2,813 $"},371,445,1875,{"v":556.5,"d":"557 $"},{"v":2812.5,"d":"2,813 $"}]
[16,"Charente","Aquitaine-Limousin-Poitou-Charentes","Riz",{"v":7023,"d":"7,023 $"},{"v":8427,"d":"8,427 $"},{"v":7179,"d":"7,179 $"},2341,2809,2393,{"v":7023,"d":"7,023 $"},{"v":7179,"d":"7,179 $"}]
[16,"Charente","Aquitaine-Limousin-Poitou-Charentes","Lait",{"v":7557,"d":"7,557 $"},{"v":9066,"d":"9,066 $"},{"v":2841,"d":"2,841 $"},2519,3022,947,{"v":8816.5,"d":"8,817 $"},{"v":3314.5,"d":"3,315 $"}]
[17,"Charente-Maritime","Aquitaine-Limousin-Poitou-Charentes","Yaourt",{"v":940.5,"d":"941 $"},{"v":1128,"d":"1,128 $"},{"v":3600,"d":"3,600 $"},627,752,2400,{"v":940.5,"d":"941 $"},{"v":3600,"d":"3,600 $"}]
[17,"Charente-Maritime","Aquitaine-Limousin-Poitou-Charentes","Riz",{"v":6153,"d":"6,153 $"},{"v":7383,"d":"7,383 $"},{"v":3078,"d":"3,078 $"},2051,2461,1026,{"v":6153,"d":"6,153 $"},{"v":3078,"d":"3,078 $"}]
[17,"Charente-Maritime","Aquitaine-Limousin-Poitou-Charentes","Fromage",{"v":6769.400000000001,"d":"6,769 $"},{"v":8122.4000000000015,"d":"8,122 $"},{"v":3773.0000000000005,"d":"3,773 $"},3077,3692,1715,{"v":7077.099999999999,"d":"7,077 $"},{"v":3944.4999999999995,"d":"3,945 $"}]
[17,"Charente-Maritime","Aquitaine-Limousin-Poitou-Charentes","Lait",{"v":11409,"d":"11,409 $"},{"v":13689,"d":"13,689 $"},{"v":3192,"d":"3,192 $"},3803,4563,1064,{"v":13310.5,"d":"13,311 $"},{"v":3724,"d":"3,724 $"}]
[17,"Charente-Maritime","Aquitaine-Limousin-Poitou-Charentes","Sucre",{"v":4670.530000000001,"d":"4,671 $"},{"v":5603.84,"d":"5,604 $"},{"v":1976.0700000000002,"d":"1,976 $"},2347,2816,993,{"v":4694,"d":"4,694 $"},{"v":1986,"d":"1,986 $"}]
[18,"Cher","Centre-Val de Loire","Lait",{"v":6648,"d":"6,648 $"},{"v":7977,"d":"7,977 $"},{"v":3543,"d":"3,543 $"},2216,2659,1181,{"v":7756,"d":"7,756 $"},{"v":4133.5,"d":"4,134 $"}]
[18,"Cher","Centre-Val de Loire","Fromage",{"v":8331.400000000001,"d":"8,331 $"},{"v":9996.800000000001,"d":"9,997 $"},{"v":3262.6000000000004,"d":"3,263 $"},3787,4544,1483,{"v":8710.099999999999,"d":"8,710 $"},{"v":3410.8999999999996,"d":"3,411 $"}]
[18,"Cher","Centre-Val de Loire","Sucre",{"v":4415.810000000001,"d":"4,416 $"},{"v":5297.380000000001,"d":"5,297 $"},{"v":5187.93,"d":"5,188 $"},2219,2662,2607,{"v":4438,"d":"4,438 $"},{"v":5214,"d":"5,214 $"}]
[18,"Cher","Centre-Val de Loire","Riz",{"v":633,"d":"633 $"},{"v":759,"d":"759 $"},{"v":6555,"d":"6,555 $"},211,253,2185,{"v":633,"d":"633 $"},{"v":6555,"d":"6,555 $"}]
[19,"Corrèze","Aquitaine-Limousin-Poitou-Charentes","Sucre",{"v":2210.8900000000003,"d":"2,211 $"},{"v":2652.67,"d":"2,653 $"},{"v":5078.480000000001,"d":"5,078 $"},1111,1333,2552,{"v":2222,"d":"2,222 $"},{"v":5104,"d":"5,104 $"}]
[19,"Corrèze","Aquitaine-Limousin-Poitou-Charentes","Lait",{"v":8031,"d":"8,031 $"},{"v":9636,"d":"9,636 $"},{"v":5856,"d":"5,856 $"},2677,3212,1952,{"v":9369.5,"d":"9,370 $"},{"v":6832,"d":"6,832 $"}]
[19,"Corrèze","Aquitaine-Limousin-Poitou-Charentes","Fromage",{"v":7774.8,"d":"7,775 $"},{"v":9328,"d":"9,328 $"},{"v":4930.200000000001,"d":"4,930 $"},3534,4240,2241,{"v":8128.2,"d":"8,128 $"},{"v":5154.299999999999,"d":"5,154 $"}]
[19,"Corrèze","Aquitaine-Limousin-Poitou-Charentes","Yaourt",{"v":1614,"d":"1,614 $"},{"v":1936.5,"d":"1,937 $"},{"v":1485,"d":"1,485 $"},1076,1291,990,{"v":1614,"d":"1,614 $"},{"v":1485,"d":"1,485 $"}]
["2B","Corse-du-Sud","Corse","Fromage",{"v":3619.0000000000005,"d":"3,619 $"},{"v":4342.8,"d":"4,343 $"},{"v":2644.4,"d":"2,644 $"},1645,1974,1202,{"v":3783.4999999999995,"d":"3,784 $"},{"v":2764.6,"d":"2,765 $"}]
["2B","Corse-du-Sud","Corse","Riz",{"v":924,"d":"924 $"},{"v":1107,"d":"1,107 $"},{"v":3213,"d":"3,213 $"},308,369,1071,{"v":924,"d":"924 $"},{"v":3213,"d":"3,213 $"}]
["2B","Corse-du-Sud","Corse","Sucre",{"v":2638.7400000000007,"d":"2,639 $"},{"v":3166.09,"d":"3,166 $"},{"v":1603.94,"d":"1,604 $"},1326,1591,806,{"v":2652,"d":"2,652 $"},{"v":1612,"d":"1,612 $"}]
["2B","Corse-du-Sud","Corse","Yaourt",{"v":2572.5,"d":"2,573 $"},{"v":3087,"d":"3,087 $"},{"v":1261.5,"d":"1,262 $"},1715,2058,841,{"v":2572.5,"d":"2,573 $"},{"v":1261.5,"d":"1,262 $"}]
[21,"Côte-d'Or","Bourgogne-Franche-Comté","Riz",{"v":8244,"d":"8,244 $"},{"v":9891,"d":"9,891 $"},{"v":4188,"d":"4,188 $"},2748,3297,1396,{"v":8244,"d":"8,244 $"},{"v":4188,"d":"4,188 $"}]
[21,"Côte-d'Or","Bourgogne-Franche-Comté","Lait",{"v":6696,"d":"6,696 $"},{"v":8034,"d":"8,034 $"},{"v":4113,"d":"4,113 $"},2232,2678,1371,{"v":7812,"d":"7,812 $"},{"v":4798.5,"d":"4,799 $"}]
[21,"Côte-d'Or","Bourgogne-Franche-Comté","Yaourt",{"v":2052,"d":"2,052 $"},{"v":2461.5,"d":"2,462 $"},{"v":3249,"d":"3,249 $"},1368,1641,2166,{"v":2052,"d":"2,052 $"},{"v":3249,"d":"3,249 $"}]
[21,"Côte-d'Or","Bourgogne-Franche-Comté","Fromage",{"v":1361.8000000000002,"d":"1,362 $"},{"v":1632.4,"d":"1,632 $"},{"v":2435.4,"d":"2,435 $"},619,742,1107,{"v":1423.6999999999998,"d":"1,424 $"},{"v":2546.1,"d":"2,546 $"}]
[21,"Côte-d'Or","Bourgogne-Franche-Comté","Sucre",{"v":6771.970000000001,"d":"6,772 $"},{"v":8125.17,"d":"8,125 $"},{"v":2622.8200000000006,"d":"2,623 $"},3403,4083,1318,{"v":6806,"d":"6,806 $"},{"v":2636,"d":"2,636 $"}]
[22,"Côtes-d'Armor","Bretagne","Sucre",{"v":3460.6100000000006,"d":"3,461 $"},{"v":4151.140000000001,"d":"4,151 $"},{"v":3229.7700000000004,"d":"3,230 $"},1739,2086,1623,{"v":3478,"d":"3,478 $"},{"v":3246,"d":"3,246 $"}]
[22,"Côtes-d'Armor","Bretagne","Yaourt",{"v":1257,"d":"1,257 $"},{"v":1507.5,"d":"1,508 $"},{"v":1648.5,"d":"1,649 $"},838,1005,1099,{"v":1257,"d":"1,257 $"},{"v":1648.5,"d":"1,649 $"}]
[22,"Côtes-d'Armor","Bretagne","Fromage",{"v":3341.8,"d":"3,342 $"},{"v":4008.4000000000005,"d":"4,008 $"},{"v":2987.6000000000004,"d":"2,988 $"},1519,1822,1358,{"v":3493.7,"d":"3,494 $"},{"v":3123.3999999999996,"d":"3,123 $"}]
[23,"Creuse","Aquitaine-Limousin-Poitou-Charentes","Sucre",{"v":3880.5,"d":"3,881 $"},{"v":4656.6,"d":"4,657 $"},{"v":4041.6900000000005,"d":"4,042 $"},1950,2340,2031,{"v":3900,"d":"3,900 $"},{"v":4062,"d":"4,062 $"}]
[23,"Creuse","Aquitaine-Limousin-Poitou-Charentes","Fromage",{"v":607.2,"d":"607 $"},{"v":728.2,"d":"728 $"},{"v":2156,"d":"2,156 $"},276,331,980,{"v":634.8,"d":"635 $"},{"v":2254,"d":"2,254 $"}]
[23,"Creuse","Aquitaine-Limousin-Poitou-Charentes","Lait",{"v":5838,"d":"5,838 $"},{"v":7005,"d":"7,005 $"},{"v":5253,"d":"5,253 $"},1946,2335,1751,{"v":6811,"d":"6,811 $"},{"v":6128.5,"d":"6,129 $"}]
[23,"Creuse","Aquitaine-Limousin-Poitou-Charentes","Riz",{"v":5529,"d":"5,529 $"},{"v":6633,"d":"6,633 $"},{"v":3996,"d":"3,996 $"},1843,2211,1332,{"v":5529,"d":"5,529 $"},{"v":3996,"d":"3,996 $"}]
[23,"Creuse","Aquitaine-Limousin-Poitou-Charentes","Yaourt",{"v":2973,"d":"2,973 $"},{"v":3567,"d":"3,567 $"},{"v":2361,"d":"2,361 $"},1982,2378,1574,{"v":2973,"d":"2,973 $"},{"v":2361,"d":"2,361 $"}]
[79,"Deux-Sèvres","Aquitaine-Limousin-Poitou-Charentes","Lait",{"v":6357,"d":"6,357 $"},{"v":7626,"d":"7,626 $"},{"v":5688,"d":"5,688 $"},2119,2542,1896,{"v":7416.5,"d":"7,417 $"},{"v":6636,"d":"6,636 $"}]
[79,"Deux-Sèvres","Aquitaine-Limousin-Poitou-Charentes","Fromage",{"v":1753.4,"d":"1,753 $"},{"v":2103.2000000000003,"d":"2,103 $"},{"v":3957.8,"d":"3,958 $"},797,956,1799,{"v":1833.1,"d":"1,833 $"},{"v":4137.7,"d":"4,138 $"}]
[79,"Deux-Sèvres","Aquitaine-Limousin-Poitou-Charentes","Yaourt",{"v":3075,"d":"3,075 $"},{"v":3690,"d":"3,690 $"},{"v":3609,"d":"3,609 $"},2050,2460,2406,{"v":3075,"d":"3,075 $"},{"v":3609,"d":"3,609 $"}]
[79,"Deux-Sèvres","Aquitaine-Limousin-Poitou-Charentes","Riz",{"v":6936,"d":"6,936 $"},{"v":8322,"d":"8,322 $"},{"v":3540,"d":"3,540 $"},2312,2774,1180,{"v":6936,"d":"6,936 $"},{"v":3540,"d":"3,540 $"}]
[79,"Deux-Sèvres","Aquitaine-Limousin-Poitou-Charentes","Sucre",{"v":5910.300000000001,"d":"5,910 $"},{"v":7092.360000000001,"d":"7,092 $"},{"v":2797.9400000000005,"d":"2,798 $"},2970,3564,1406,{"v":5940,"d":"5,940 $"},{"v":2812,"d":"2,812 $"}]
[24,"Dordogne","Aquitaine-Limousin-Poitou-Charentes","Sucre",{"v":2863.6100000000006,"d":"2,864 $"},{"v":3434.7400000000007,"d":"3,435 $"},{"v":4352.130000000001,"d":"4,352 $"},1439,1726,2187,{"v":2878,"d":"2,878 $"},{"v":4374,"d":"4,374 $"}]
[24,"Dordogne","Aquitaine-Limousin-Poitou-Charentes","Riz",{"v":3114,"d":"3,114 $"},{"v":3735,"d":"3,735 $"},{"v":6852,"d":"6,852 $"},1038,1245,2284,{"v":3114,"d":"3,114 $"},{"v":6852,"d":"6,852 $"}]
[24,"Dordogne","Aquitaine-Limousin-Poitou-Charentes","Lait",{"v":1497,"d":"1,497 $"},{"v":1794,"d":"1,794 $"},{"v":3012,"d":"3,012 $"},499,598,1004,{"v":1746.5,"d":"1,747 $"},{"v":3514,"d":"3,514 $"}]
[24,"Dordogne","Aquitaine-Limousin-Poitou-Charentes","Yaourt",{"v":1417.5,"d":"1,418 $"},{"v":1701,"d":"1,701 $"},{"v":2823,"d":"2,823 $"},945,1134,1882,{"v":1417.5,"d":"1,418 $"},{"v":2823,"d":"2,823 $"}]
[25,"Doubs","Bourgogne-Franche-Comté","Lait",{"v":3114,"d":"3,114 $"},{"v":3735,"d":"3,735 $"},{"v":7287,"d":"7,287 $"},1038,1245,2429,{"v":3633,"d":"3,633 $"},{"v":8501.5,"d":"8,502 $"}]
[25,"Doubs","Bourgogne-Franche-Comté","Sucre",{"v":3026.79,"d":"3,027 $"},{"v":3631.75,"d":"3,632 $"},{"v":2652.67,"d":"2,653 $"},1521,1825,1333,{"v":3042,"d":"3,042 $"},{"v":2666,"d":"2,666 $"}]
[25,"Doubs","Bourgogne-Franche-Comté","Riz",{"v":3927,"d":"3,927 $"},{"v":4710,"d":"4,710 $"},{"v":2730,"d":"2,730 $"},1309,1570,910,{"v":3927,"d":"3,927 $"},{"v":2730,"d":"2,730 $"}]
[26,"Drôme","Auvergne-Rhône-Alpes","Yaourt",{"v":1228.5,"d":"1,229 $"},{"v":1473,"d":"1,473 $"},{"v":1338,"d":"1,338 $"},819,982,892,{"v":1228.5,"d":"1,229 $"},{"v":1338,"d":"1,338 $"}]
[26,"Drôme","Auvergne-Rhône-Alpes","Fromage",{"v":3176.8,"d":"3,177 $"},{"v":3810.4,"d":"3,810 $"},{"v":3691.6000000000004,"d":"3,692 $"},1444,1732,1678,{"v":3321.2,"d":"3,321 $"},{"v":3859.3999999999996,"d":"3,859 $"}]
[26,"Drôme","Auvergne-Rhône-Alpes","Sucre",{"v":384.07000000000005,"d":"384 $"},{"v":459.69000000000005,"d":"460 $"},{"v":5124.25,"d":"5,124 $"},193,231,2575,{"v":386,"d":"386 $"},{"v":5150,"d":"5,150 $"}]
[26,"Drôme","Auvergne-Rhône-Alpes","Lait",{"v":3837,"d":"3,837 $"},{"v":4602,"d":"4,602 $"},{"v":7413,"d":"7,413 $"},1279,1534,2471,{"v":4476.5,"d":"4,477 $"},{"v":8648.5,"d":"8,649 $"}]
[26,"Drôme","Auvergne-Rhône-Alpes","Riz",{"v":402,"d":"402 $"},{"v":480,"d":"480 $"},{"v":5478,"d":"5,478 $"},134,160,1826,{"v":402,"d":"402 $"},{"v":5478,"d":"5,478 $"}]
[91,"Essonne","Île-de-France","Lait",{"v":5319,"d":"5,319 $"},{"v":6381,"d":"6,381 $"},{"v":5055,"d":"5,055 $"},1773,2127,1685,{"v":6205.5,"d":"6,206 $"},{"v":5897.5,"d":"5,898 $"}]
[91,"Essonne","Île-de-France","Yaourt",{"v":2889,"d":"2,889 $"},{"v":3466.5,"d":"3,467 $"},{"v":2397,"d":"2,397 $"},1926,2311,1598,{"v":2889,"d":"2,889 $"},{"v":2397,"d":"2,397 $"}]
[91,"Essonne","Île-de-France","Riz",{"v":7209,"d":"7,209 $"},{"v":8649,"d":"8,649 $"},{"v":3096,"d":"3,096 $"},2403,2883,1032,{"v":7209,"d":"7,209 $"},{"v":3096,"d":"3,096 $"}]
[27,"Eure","Normandie","Fromage",{"v":3773.0000000000005,"d":"3,773 $"},{"v":4326,"d":"4,326 $"},{"v":2341,"d":"2,341 $"},1715,2058,969,{"v":3944.4999999999995,"d":"3,945 $"},{"v":2228.7,"d":"2,229 $"}]
[27,"Eure","Normandie","Yaourt",{"v":3036,"d":"3,036 $"},{"v":3642,"d":"3,642 $"},{"v":2997,"d":"2,997 $"},2024,2428,1998,{"v":3036,"d":"3,036 $"},{"v":2997,"d":"2,997 $"}]
[27,"Eure","Normandie","Riz",{"v":7932,"d":"7,932 $"},{"v":9516,"d":"9,516 $"},{"v":3651,"d":"3,651 $"},2644,3172,1217,{"v":7932,"d":"7,932 $"},{"v":3651,"d":"3,651 $"}]
[27,"Eure","Normandie","Sucre",{"v":4941.17,"d":"4,941 $"},{"v":5928.210000000001,"d":"5,928 $"},{"v":4081.4900000000007,"d":"4,081 $"},2483,2979,2051,{"v":4966,"d":"4,966 $"},{"v":4102,"d":"4,102 $"}]
[28,"Eure-et-Loir","Centre-Val de Loire","Riz",{"v":5061,"d":"5,061 $"},{"v":6072,"d":"6,072 $"},{"v":4341,"d":"4,341 $"},1687,2024,1447,{"v":5061,"d":"5,061 $"},{"v":4341,"d":"4,341 $"}]
[28,"Eure-et-Loir","Centre-Val de Loire","Sucre",{"v":2602.92,"d":"2,603 $"},{"v":3122.3100000000004,"d":"3,122 $"},{"v":3456.63,"d":"3,457 $"},1308,1569,1737,{"v":2616,"d":"2,616 $"},{"v":3474,"d":"3,474 $"}]
[28,"Eure-et-Loir","Centre-Val de Loire","Fromage",{"v":7185.200000000001,"d":"7,185 $"},{"v":8621.800000000001,"d":"8,622 $"},{"v":5407.6,"d":"5,408 $"},3266,3919,2458,{"v":7511.799999999999,"d":"7,512 $"},{"v":5653.4,"d":"5,653 $"}]
[28,"Eure-et-Loir","Centre-Val de Loire","Lait",{"v":309,"d":"309 $"},{"v":369,"d":"369 $"},{"v":3462,"d":"3,462 $"},103,123,1154,{"v":360.5,"d":"361 $"},{"v":4039,"d":"4,039 $"}]
[28,"Eure-et-Loir","Centre-Val de Loire","Yaourt",{"v":5616,"d":"5,616 $"},{"v":6738,"d":"6,738 $"},{"v":3531,"d":"3,531 $"},3744,4492,2354,{"v":5616,"d":"5,616 $"},{"v":3531,"d":"3,531 $"}]
[29,"Finistère","Bretagne","Yaourt",{"$f":"H131*VLOOKUP($D131,$Q$2:$S$6,3,0)-K131","v":{"v":411,"d":"411 $"}},{"$f":"I131*VLOOKUP($D131,$Q$2:$S$6,3,0)-I131*VLOOKUP($D131,$Q$2:$S$6,2,0)","v":{"v":492,"d":"492 $"}},{"$f":"J131*VLOOKUP($D131,$Q$2:$S$6,3,0)-L131","v":{"v":1653,"d":"1,653 $"}},274,{"$f":"INT(H131*1.2)","v":328},1102,{"$f":"H131*VLOOKUP($D131,$Q$2:$S$6,2,0)","v":{"v":411,"d":"411 $"}},{"$f":"J131*VLOOKUP($D131,$Q$2:$S$6,2,0)","v":{"v":1653,"d":"1,653 $"}}]
[29,"Finistère","Bretagne","Riz",{"v":1767,"d":"1,767 $"},{"v":2118,"d":"2,118 $"},{"v":6369,"d":"6,369 $"},589,706,2123,{"v":1767,"d":"1,767 $"},{"v":6369,"d":"6,369 $"}]
[29,"Finistère","Bretagne","Fromage",{"v":5843.200000000001,"d":"5,843 $"},{"v":7011.400000000001,"d":"7,011 $"},{"v":5915.8,"d":"5,916 $"},2656,3187,2689,{"v":6108.799999999999,"d":"6,109 $"},{"v":6184.7,"d":"6,185 $"}]
[29,"Finistère","Bretagne","Sucre",{"v":33.83,"d":"34 $"},{"v":39.80000000000001,"d":"40 $"},{"v":4656.6,"d":"4,657 $"},17,20,2340,{"v":34,"d":"34 $"},{"v":4680,"d":"4,680 $"}]
[30,"Gard","Languedoc-Roussillon-Midi-Pyrénées","Riz",{"v":1683,"d":"1,683 $"},{"v":2019,"d":"2,019 $"},{"v":4593,"d":"4,593 $"},561,673,1531,{"v":1683,"d":"1,683 $"},{"v":4593,"d":"4,593 $"}]
[30,"Gard","Languedoc-Roussillon-Midi-Pyrénées","Fromage",{"v":3405.6000000000004,"d":"3,406 $"},{"v":4085.4000000000005,"d":"4,085 $"},{"v":4232.8,"d":"4,233 $"},1548,1857,1924,{"v":3560.3999999999996,"d":"3,560 $"},{"v":4425.2,"d":"4,425 $"}]
[30,"Gard","Languedoc-Roussillon-Midi-Pyrénées","Lait",{"v":3126,"d":"3,126 $"},{"v":3750,"d":"3,750 $"},{"v":5793,"d":"5,793 $"},1042,1250,1931,{"v":3647,"d":"3,647 $"},{"v":6758.5,"d":"6,759 $"}]
[30,"Gard","Languedoc-Roussillon-Midi-Pyrénées","Sucre",{"v":7028.68,"d":"7,029 $"},{"v":8433.620000000003,"d":"8,434 $"},{"v":3970.05,"d":"3,970 $"},3532,4238,1995,{"v":7064,"d":"7,064 $"},{"v":3990,"d":"3,990 $"}]
[30,"Gard","Languedoc-Roussillon-Midi-Pyrénées","Yaourt",{"v":1278,"d":"1,278 $"},{"v":1533,"d":"1,533 $"},{"v":3841.5,"d":"3,842 $"},852,1022,2561,{"v":1278,"d":"1,278 $"},{"v":3841.5,"d":"3,842 $"}]
[32,"Gers","Languedoc-Roussillon-Midi-Pyrénées","Riz",{"v":5115,"d":"5,115 $"},{"v":6138,"d":"6,138 $"},{"v":7236,"d":"7,236 $"},1705,2046,2412,{"v":5115,"d":"5,115 $"},{"v":7236,"d":"7,236 $"}]
[32,"Gers","Languedoc-Roussillon-Midi-Pyrénées","Sucre",{"v":3989.9500000000007,"d":"3,990 $"},{"v":4787.9400000000005,"d":"4,788 $"},{"v":4401.880000000001,"d":"4,402 $"},2005,2406,2212,{"v":4010,"d":"4,010 $"},{"v":4424,"d":"4,424 $"}]
[32,"Gers","Languedoc-Roussillon-Midi-Pyrénées","Lait",{"v":7770,"d":"7,770 $"},{"v":9324,"d":"9,324 $"},{"v":5229,"d":"5,229 $"},2590,3108,1743,{"v":9065,"d":"9,065 $"},{"v":6100.5,"d":"6,101 $"}]
[32,"Gers","Languedoc-Roussillon-Midi-Pyrénées","Fromage",{"v":5852.000000000001,"d":"5,852 $"},{"v":7022.400000000001,"d":"7,022 $"},{"v":3790.6000000000004,"d":"3,791 $"},2660,3192,1723,{"v":6117.999999999999,"d":"6,118 $"},{"v":3962.8999999999996,"d":"3,963 $"}]
[33,"Gironde","Aquitaine-Limousin-Poitou-Charentes","Sucre",{"v":3452.6500000000005,"d":"3,453 $"},{"v":4143.18,"d":"4,143 $"},{"v":4911.32,"d":"4,911 $"},1735,2082,2468,{"v":3470,"d":"3,470 $"},{"v":4936,"d":"4,936 $"}]
[33,"Gironde","Aquitaine-Limousin-Poitou-Charentes","Yaourt",{"v":3510,"d":"3,510 $"},{"v":4212,"d":"4,212 $"},{"v":3889.5,"d":"3,890 $"},2340,2808,2593,{"v":3510,"d":"3,510 $"},{"v":3889.5,"d":"3,890 $"}]
[33,"Gironde","Aquitaine-Limousin-Poitou-Charentes","Fromage",{"v":4657.400000000001,"d":"4,657 $"},{"v":5588,"d":"5,588 $"},{"v":4067.8,"d":"4,068 $"},2117,2540,1849,{"v":4869.099999999999,"d":"4,869 $"},{"v":4252.7,"d":"4,253 $"}]
[33,"Gironde","Aquitaine-Limousin-Poitou-Charentes","Lait",{"v":7311,"d":"7,311 $"},{"v":8772,"d":"8,772 $"},{"v":2670,"d":"2,670 $"},2437,2924,890,{"v":8529.5,"d":"8,530 $"},{"v":3115,"d":"3,115 $"}]
["2A","Haute-Corse","Corse","Sucre",{"v":6545.110000000001,"d":"6,545 $"},{"v":7852.540000000001,"d":"7,853 $"},{"v":1904.4300000000003,"d":"1,904 $"},3289,3946,957,{"v":6578,"d":"6,578 $"},{"v":1914,"d":"1,914 $"}]
["2A","Haute-Corse","Corse","Riz",{"v":9600,"d":"9,600 $"},{"v":11520,"d":"11,520 $"},{"v":3438,"d":"3,438 $"},3200,3840,1146,{"v":9600,"d":"9,600 $"},{"v":3438,"d":"3,438 $"}]
["2A","Haute-Corse","Corse","Fromage",{"v":4468.200000000001,"d":"4,468 $"},{"v":5361.400000000001,"d":"5,361 $"},{"v":5332.8,"d":"5,333 $"},2031,2437,2424,{"v":4671.299999999999,"d":"4,671 $"},{"v":5575.2,"d":"5,575 $"}]
["2A","Haute-Corse","Corse","Lait",{"v":1995,"d":"1,995 $"},{"v":2394,"d":"2,394 $"},{"v":3912,"d":"3,912 $"},665,798,1304,{"v":2327.5,"d":"2,328 $"},{"v":4564,"d":"4,564 $"}]
["2A","Haute-Corse","Corse","Yaourt",{"v":2023.5,"d":"2,024 $"},{"v":2427,"d":"2,427 $"},{"v":1453.5,"d":"1,454 $"},1349,1618,969,{"v":2023.5,"d":"2,024 $"},{"v":1453.5,"d":"1,454 $"}]
[31,"Haute-Garonne","Languedoc-Roussillon-Midi-Pyrénées","Fromage",{"v":616,"d":"616 $"},{"v":739.2,"d":"739 $"},{"v":4389,"d":"4,389 $"},280,336,1995,{"v":644,"d":"644 $"},{"v":4588.5,"d":"4,589 $"}]
[31,"Haute-Garonne","Languedoc-Roussillon-Midi-Pyrénées","Lait",{"v":4941,"d":"4,941 $"},{"v":5928,"d":"5,928 $"},{"v":7503,"d":"7,503 $"},1647,1976,2501,{"v":5764.5,"d":"5,765 $"},{"v":8753.5,"d":"8,754 $"}]
[31,"Haute-Garonne","Languedoc-Roussillon-Midi-Pyrénées","Yaourt",{"v":699,"d":"699 $"},{"v":838.5,"d":"839 $"},{"v":1366.5,"d":"1,367 $"},466,559,911,{"v":699,"d":"699 $"},{"v":1366.5,"d":"1,367 $"}]
[31,"Haute-Garonne","Languedoc-Roussillon-Midi-Pyrénées","Riz",{"v":180,"d":"180 $"},{"v":216,"d":"216 $"},{"v":4095,"d":"4,095 $"},60,72,1365,{"v":180,"d":"180 $"},{"v":4095,"d":"4,095 $"}]
[31,"Haute-Garonne","Languedoc-Roussillon-Midi-Pyrénées","Sucre",{"v":2988.9800000000005,"d":"2,989 $"},{"v":3585.9800000000005,"d":"3,586 $"},{"v":2807.8900000000003,"d":"2,808 $"},1502,1802,1411,{"v":3004,"d":"3,004 $"},{"v":2822,"d":"2,822 $"}]
[43,"Haute-Loire","Auvergne-Rhône-Alpes","Lait",{"v":5709,"d":"5,709 $"},{"v":6849,"d":"6,849 $"},{"v":6867,"d":"6,867 $"},1903,2283,2289,{"v":6660.5,"d":"6,661 $"},{"v":8011.5,"d":"8,012 $"}]
[43,"Haute-Loire","Auvergne-Rhône-Alpes","Yaourt",{"v":151.5,"d":"152 $"},{"v":181.5,"d":"182 $"},{"v":3091.5,"d":"3,092 $"},101,121,2061,{"v":151.5,"d":"152 $"},{"v":3091.5,"d":"3,092 $"}]
[43,"Haute-Loire","Auvergne-Rhône-Alpes","Sucre",{"v":7936.120000000001,"d":"7,936 $"},{"v":9522.150000000001,"d":"9,522 $"},{"v":2981.0200000000004,"d":"2,981 $"},3988,4785,1498,{"v":7976,"d":"7,976 $"},{"v":2996,"d":"2,996 $"}]
[43,"Haute-Loire","Auvergne-Rhône-Alpes","Fromage",{"v":1122,"d":"1,122 $"},{"v":1346.4,"d":"1,346 $"},{"v":3955.6000000000004,"d":"3,956 $"},510,612,1798,{"v":1173,"d":"1,173 $"},{"v":4135.4,"d":"4,135 $"}]
[43,"Haute-Loire","Auvergne-Rhône-Alpes","Riz",{"v":4983,"d":"4,983 $"},{"v":5979,"d":"5,979 $"},{"v":7098,"d":"7,098 $"},1661,1993,2366,{"v":4983,"d":"4,983 $"},{"v":7098,"d":"7,098 $"}]
[52,"Haute-Marne","Alsace-Champagne-Ardenne-Lorraine","Fromage",{"v":1969,"d":"1,969 $"},{"v":2362.8,"d":"2,363 $"},{"v":4943.400000000001,"d":"4,943 $"},895,1074,2247,{"v":2058.5,"d":"2,059 $"},{"v":5168.099999999999,"d":"5,168 $"}]
[52,"Haute-Marne","Alsace-Champagne-Ardenne-Lorraine","Yaourt",{"v":1065,"d":"1,065 $"},{"v":1278,"d":"1,278 $"},{"v":4063.5,"d":"4,064 $"},710,852,2709,{"v":1065,"d":"1,065 $"},{"v":4063.5,"d":"4,064 $"}]
[52,"Haute-Marne","Alsace-Champagne-Ardenne-Lorraine","Lait",{"v":660,"d":"660 $"},{"v":792,"d":"792 $"},{"v":3150,"d":"3,150 $"},220,264,1050,{"v":770,"d":"770 $"},{"v":3675,"d":"3,675 $"}]
[52,"Haute-Marne","Alsace-Champagne-Ardenne-Lorraine","Riz",{"v":1584,"d":"1,584 $"},{"v":1899,"d":"1,899 $"},{"v":7005,"d":"7,005 $"},528,633,2335,{"v":1584,"d":"1,584 $"},{"v":7005,"d":"7,005 $"}]
[52,"Haute-Marne","Alsace-Champagne-Ardenne-Lorraine","Sucre",{"v":1134.3000000000002,"d":"1,134 $"},{"v":1361.1600000000003,"d":"1,361 $"},{"v":5000.870000000001,"d":"5,001 $"},570,684,2513,{"v":1140,"d":"1,140 $"},{"v":5026,"d":"5,026 $"}]
[5,"Hautes-Alpes","Provence-Alpes-Côte d'Azur","Yaourt",{"v":685.5,"d":"686 $"},{"v":822,"d":"822 $"},{"v":2721,"d":"2,721 $"},457,548,1814,{"v":685.5,"d":"686 $"},{"v":2721,"d":"2,721 $"}]
[5,"Hautes-Alpes","Provence-Alpes-Côte d'Azur","Lait",{"v":1815,"d":"1,815 $"},{"v":2178,"d":"2,178 $"},{"v":6279,"d":"6,279 $"},605,726,2093,{"v":2117.5,"d":"2,118 $"},{"v":7325.5,"d":"7,326 $"}]
[5,"Hautes-Alpes","Provence-Alpes-Côte d'Azur","Riz",{"v":5097,"d":"5,097 $"},{"v":6114,"d":"6,114 $"},{"v":5565,"d":"5,565 $"},1699,2038,1855,{"v":5097,"d":"5,097 $"},{"v":5565,"d":"5,565 $"}]
[70,"Haute-Saône","Bourgogne-Franche-Comté","Lait",{"v":7593,"d":"7,593 $"},{"v":9111,"d":"9,111 $"},{"v":2397,"d":"2,397 $"},2531,3037,799,{"v":8858.5,"d":"8,859 $"},{"v":2796.5,"d":"2,797 $"}]
[70,"Haute-Saône","Bourgogne-Franche-Comté","Riz",{"v":5571,"d":"5,571 $"},{"v":6684,"d":"6,684 $"},{"v":2799,"d":"2,799 $"},1857,2228,933,{"v":5571,"d":"5,571 $"},{"v":2799,"d":"2,799 $"}]
[70,"Haute-Saône","Bourgogne-Franche-Comté","Sucre",{"v":3275.54,"d":"3,276 $"},{"v":3930.25,"d":"3,930 $"},{"v":5102.360000000001,"d":"5,102 $"},1646,1975,2564,{"v":3292,"d":"3,292 $"},{"v":5128,"d":"5,128 $"}]
[74,"Haute-Savoie","Auvergne-Rhône-Alpes","Yaourt",{"v":2628,"d":"2,628 $"},{"v":3153,"d":"3,153 $"},{"v":2011.5,"d":"2,012 $"},1752,2102,1341,{"v":2628,"d":"2,628 $"},{"v":2011.5,"d":"2,012 $"}]
[74,"Haute-Savoie","Auvergne-Rhône-Alpes","Lait",{"v":5934,"d":"5,934 $"},{"v":7119,"d":"7,119 $"},{"v":4989,"d":"4,989 $"},1978,2373,1663,{"v":6923,"d":"6,923 $"},{"v":5820.5,"d":"5,821 $"}]
[74,"Haute-Savoie","Auvergne-Rhône-Alpes","Riz",{"v":4767,"d":"4,767 $"},{"v":5718,"d":"5,718 $"},{"v":4059,"d":"4,059 $"},1589,1906,1353,{"v":4767,"d":"4,767 $"},{"v":4059,"d":"4,059 $"}]
[74,"Haute-Savoie","Auvergne-Rhône-Alpes","Fromage",{"v":6355.8,"d":"6,356 $"},{"v":7625.200000000001,"d":"7,625 $"},{"v":3410.0000000000005,"d":"3,410 $"},2889,3466,1550,{"v":6644.7,"d":"6,645 $"},{"v":3564.9999999999995,"d":"3,565 $"}]
[74,"Haute-Savoie","Auvergne-Rhône-Alpes","Sucre",{"v":5170.02,"d":"5,170 $"},{"v":6202.83,"d":"6,203 $"},{"v":3788.96,"d":"3,789 $"},2598,3117,1904,{"v":5196,"d":"5,196 $"},{"v":3808,"d":"3,808 $"}]
[65,"Hautes-Pyrénées","Languedoc-Roussillon-Midi-Pyrénées","Fromage",{"v":5781.6,"d":"5,782 $"},{"v":6936.6,"d":"6,937 $"},{"v":5093,"d":"5,093 $"},2628,3153,2315,{"v":6044.4,"d":"6,044 $"},{"v":5324.5,"d":"5,325 $"}]
[65,"Hautes-Pyrénées","Languedoc-Roussillon-Midi-Pyrénées","Yaourt",{"v":4855.5,"d":"4,856 $"},{"v":5826,"d":"5,826 $"},{"v":3261,"d":"3,261 $"},3237,3884,2174,{"v":4855.5,"d":"4,856 $"},{"v":3261,"d":"3,261 $"}]
[65,"Hautes-Pyrénées","Languedoc-Roussillon-Midi-Pyrénées","Riz",{"v":10473,"d":"10,473 $"},{"v":12567,"d":"12,567 $"},{"v":7884,"d":"7,884 $"},3491,4189,2628,{"v":10473,"d":"10,473 $"},{"v":7884,"d":"7,884 $"}]
[65,"Hautes-Pyrénées","Languedoc-Roussillon-Midi-Pyrénées","Sucre",{"v":6813.76,"d":"6,814 $"},{"v":8174.920000000002,"d":"8,175 $"},{"v":2491.4800000000005,"d":"2,491 $"},3424,4108,1252,{"v":6848,"d":"6,848 $"},{"v":2504,"d":"2,504 $"}]
[65,"Hautes-Pyrénées","Languedoc-Roussillon-Midi-Pyrénées","Lait",{"v":867,"d":"867 $"},{"v":1038,"d":"1,038 $"},{"v":5745,"d":"5,745 $"},289,346,1915,{"v":1011.5,"d":"1,012 $"},{"v":6702.5,"d":"6,703 $"}]
[87,"Haute-Vienne","Aquitaine-Limousin-Poitou-Charentes","Lait",{"v":8676,"d":"8,676 $"},{"v":10410,"d":"10,410 $"},{"v":4770,"d":"4,770 $"},2892,3470,1590,{"v":10122,"d":"10,122 $"},{"v":5565,"d":"5,565 $"}]
[87,"Haute-Vienne","Aquitaine-Limousin-Poitou-Charentes","Yaourt",{"v":1285.5,"d":"1,286 $"},{"v":1542,"d":"1,542 $"},{"v":3831,"d":"3,831 $"},857,1028,2554,{"v":1285.5,"d":"1,286 $"},{"v":3831,"d":"3,831 $"}]
[87,"Haute-Vienne","Aquitaine-Limousin-Poitou-Charentes","Sucre",{"v":4364.07,"d":"4,364 $"},{"v":5235.6900000000005,"d":"5,236 $"},{"v":4376.01,"d":"4,376 $"},2193,2631,2199,{"v":4386,"d":"4,386 $"},{"v":4398,"d":"4,398 $"}]
[87,"Haute-Vienne","Aquitaine-Limousin-Poitou-Charentes","Riz",{"v":8163,"d":"8,163 $"},{"v":9795,"d":"9,795 $"},{"v":3309,"d":"3,309 $"},2721,3265,1103,{"v":8163,"d":"8,163 $"},{"v":3309,"d":"3,309 $"}]
[87,"Haute-Vienne","Aquitaine-Limousin-Poitou-Charentes","Fromage",{"v":4100.8,"d":"4,101 $"},{"v":4919.200000000001,"d":"4,919 $"},{"v":2648.8,"d":"2,649 $"},1864,2236,1204,{"v":4287.2,"d":"4,287 $"},{"v":2769.2,"d":"2,769 $"}]
[68,"Haut-Rhin","Alsace-Champagne-Ardenne-Lorraine","Sucre",{"v":4465.560000000001,"d":"4,466 $"},{"v":5357.08,"d":"5,357 $"},{"v":4214.82,"d":"4,215 $"},2244,2692,2118,{"v":4488,"d":"4,488 $"},{"v":4236,"d":"4,236 $"}]
[68,"Haut-Rhin","Alsace-Champagne-Ardenne-Lorraine","Riz",{"v":11541,"d":"11,541 $"},{"v":13848,"d":"13,848 $"},{"v":4542,"d":"4,542 $"},3847,4616,1514,{"v":11541,"d":"11,541 $"},{"v":4542,"d":"4,542 $"}]
[68,"Haut-Rhin","Alsace-Champagne-Ardenne-Lorraine","Lait",{"v":1647,"d":"1,647 $"},{"v":1974,"d":"1,974 $"},{"v":6723,"d":"6,723 $"},549,658,2241,{"v":1921.5,"d":"1,922 $"},{"v":7843.5,"d":"7,844 $"}]
[68,"Haut-Rhin","Alsace-Champagne-Ardenne-Lorraine","Fromage",{"v":926.2,"d":"926 $"},{"v":1111,"d":"1,111 $"},{"v":3625.6000000000004,"d":"3,626 $"},421,505,1648,{"v":968.3,"d":"968 $"},{"v":3790.3999999999996,"d":"3,790 $"}]
[92,"Hauts-de-Seine","Île-de-France","Fromage",{"v":1476.2,"d":"1,476 $"},{"v":1771.0000000000002,"d":"1,771 $"},{"v":1817.2,"d":"1,817 $"},671,805,826,{"v":1543.3,"d":"1,543 $"},{"v":1899.8,"d":"1,900 $"}]
[92,"Hauts-de-Seine","Île-de-France","Sucre",{"v":2278.55,"d":"2,279 $"},{"v":2734.26,"d":"2,734 $"},{"v":2085.5200000000004,"d":"2,086 $"},1145,1374,1048,{"v":2290,"d":"2,290 $"},{"v":2096,"d":"2,096 $"}]
[92,"Hauts-de-Seine","Île-de-France","Lait",{"$f":"H195*VLOOKUP($D195,$Q$2:$S$6,3,0)-K195","v":{"v":450,"d":"450 $"}},{"$f":"I195*VLOOKUP($D195,$Q$2:$S$6,3,0)-I195*VLOOKUP($D195,$Q$2:$S$6,2,0)","v":{"v":540,"d":"540 $"}},{"$f":"J195*VLOOKUP($D195,$Q$2:$S$6,3,0)-L195","v":{"v":2862,"d":"2,862 $"}},150,{"$f":"INT(H195*1.2)","v":180},954,{"$f":"H195*VLOOKUP($D195,$Q$2:$S$6,2,0)","v":{"v":525,"d":"525 $"}},{"$f":"J195*VLOOKUP($D195,$Q$2:$S$6,2,0)","v":{"v":3339,"d":"3,339 $"}}]
[92,"Hauts-de-Seine","Île-de-France","Riz",{"v":10941,"d":"10,941 $"},{"v":13128,"d":"13,128 $"},{"v":7710,"d":"7,710 $"},3647,4376,2570,{"v":10941,"d":"10,941 $"},{"v":7710,"d":"7,710 $"}]
[92,"Hauts-de-Seine","Île-de-France","Yaourt",{"v":4084.5,"d":"4,085 $"},{"v":4900.5,"d":"4,901 $"},{"v":2506.5,"d":"2,507 $"},2723,3267,1671,{"v":4084.5,"d":"4,085 $"},{"v":2506.5,"d":"2,507 $"}]
[34,"Hérault","Languedoc-Roussillon-Midi-Pyrénées","Lait",{"v":10458,"d":"10,458 $"},{"v":12549,"d":"12,549 $"},{"v":4374,"d":"4,374 $"},3486,4183,1458,{"v":12201,"d":"12,201 $"},{"v":5103,"d":"5,103 $"}]
[34,"Hérault","Languedoc-Roussillon-Midi-Pyrénées","Yaourt",{"v":5005.5,"d":"5,006 $"},{"v":6006,"d":"6,006 $"},{"v":3720,"d":"3,720 $"},3337,4004,2480,{"v":5005.5,"d":"5,006 $"},{"v":3720,"d":"3,720 $"}]
[34,"Hérault","Languedoc-Roussillon-Midi-Pyrénées","Riz",{"v":3435,"d":"3,435 $"},{"v":4122,"d":"4,122 $"},{"v":5505,"d":"5,505 $"},1145,1374,1835,{"v":3435,"d":"3,435 $"},{"v":5505,"d":"5,505 $"}]
[34,"Hérault","Languedoc-Roussillon-Midi-Pyrénées","Sucre",{"v":4179,"d":"4,179 $"},{"v":5014.800000000001,"d":"5,015 $"},{"v":4244.67,"d":"4,245 $"},2100,2520,2133,{"v":4200,"d":"4,200 $"},{"v":4266,"d":"4,266 $"}]
[35,"Ille-et-Vilaine","Bretagne","Sucre",{"v":682.5700000000002,"d":"683 $"},{"v":817.8900000000001,"d":"818 $"},{"v":4053.63,"d":"4,054 $"},343,411,2037,{"v":686,"d":"686 $"},{"v":4074,"d":"4,074 $"}]
[35,"Ille-et-Vilaine","Bretagne","Yaourt",{"v":3202.5,"d":"3,203 $"},{"v":3843,"d":"3,843 $"},{"v":2892,"d":"2,892 $"},2135,2562,1928,{"v":3202.5,"d":"3,203 $"},{"v":2892,"d":"2,892 $"}]
[35,"Ille-et-Vilaine","Bretagne","Riz",{"v":8019,"d":"8,019 $"},{"v":9621,"d":"9,621 $"},{"v":4068,"d":"4,068 $"},2673,3207,1356,{"v":8019,"d":"8,019 $"},{"v":4068,"d":"4,068 $"}]
[35,"Ille-et-Vilaine","Bretagne","Fromage",{"v":334.40000000000003,"d":"334 $"},{"v":400.40000000000003,"d":"400 $"},{"v":5082,"d":"5,082 $"},152,182,2310,{"v":349.59999999999997,"d":"350 $"},{"v":5313,"d":"5,313 $"}]
[35,"Ille-et-Vilaine","Bretagne","Lait",{"v":5796,"d":"5,796 $"},{"v":6954,"d":"6,954 $"},{"v":4350,"d":"4,350 $"},1932,2318,1450,{"v":6762,"d":"6,762 $"},{"v":5075,"d":"5,075 $"}]
[36,"Indre","Centre-Val de Loire","Lait",{"v":558,"d":"558 $"},{"v":669,"d":"669 $"},{"v":8019,"d":"8,019 $"},186,223,2673,{"v":651,"d":"651 $"},{"v":9355.5,"d":"9,356 $"}]
[36,"Indre","Centre-Val de Loire","Yaourt",{"v":1846.5,"d":"1,847 $"},{"v":2215.5,"d":"2,216 $"},{"v":3448.5,"d":"3,449 $"},1231,1477,2299,{"v":1846.5,"d":"1,847 $"},{"v":3448.5,"d":"3,449 $"}]
[36,"Indre","Centre-Val de Loire","Sucre",{"v":5556.08,"d":"5,556 $"},{"v":6666.5,"d":"6,667 $"},{"v":5028.730000000001,"d":"5,029 $"},2792,3350,2527,{"v":5584,"d":"5,584 $"},{"v":5054,"d":"5,054 $"}]
[36,"Indre","Centre-Val de Loire","Riz",{"v":10458,"d":"10,458 $"},{"v":12549,"d":"12,549 $"},{"v":3666,"d":"3,666 $"},3486,4183,1222,{"v":10458,"d":"10,458 $"},{"v":3666,"d":"3,666 $"}]
[37,"Indre-et-Loire","Centre-Val de Loire","Yaourt",{"v":1072.5,"d":"1,073 $"},{"v":1287,"d":"1,287 $"},{"v":3768,"d":"3,768 $"},715,858,2512,{"v":1072.5,"d":"1,073 $"},{"v":3768,"d":"3,768 $"}]
[37,"Indre-et-Loire","Centre-Val de Loire","Sucre",{"v":3554.1400000000003,"d":"3,554 $"},{"v":4264.57,"d":"4,265 $"},{"v":1791,"d":"1,791 $"},1786,2143,900,{"v":3572,"d":"3,572 $"},{"v":1800,"d":"1,800 $"}]
[37,"Indre-et-Loire","Centre-Val de Loire","Fromage",{"v":466.40000000000003,"d":"466 $"},{"v":558.8000000000001,"d":"559 $"},{"v":5937.8,"d":"5,938 $"},212,254,2699,{"v":487.59999999999997,"d":"488 $"},{"v":6207.7,"d":"6,208 $"}]
[38,"Isère","Auvergne-Rhône-Alpes","Sucre",{"v":1922.3400000000001,"d":"1,922 $"},{"v":2306.41,"d":"2,306 $"},{"v":3259.620000000001,"d":"3,260 $"},966,1159,1638,{"v":1932,"d":"1,932 $"},{"v":3276,"d":"3,276 $"}]
[38,"Isère","Auvergne-Rhône-Alpes","Yaourt",{"v":1318.5,"d":"1,319 $"},{"v":1581,"d":"1,581 $"},{"v":3829.5,"d":"3,830 $"},879,1054,2553,{"v":1318.5,"d":"1,319 $"},{"v":3829.5,"d":"3,830 $"}]
[38,"Isère","Auvergne-Rhône-Alpes","Fromage",{"v":2849.0000000000005,"d":"2,849 $"},{"v":3418.8,"d":"3,419 $"},{"v":1722.6000000000001,"d":"1,723 $"},1295,1554,783,{"v":2978.4999999999995,"d":"2,979 $"},{"v":1800.8999999999999,"d":"1,801 $"}]
[38,"Isère","Auvergne-Rhône-Alpes","Lait",{"v":3285,"d":"3,285 $"},{"v":3942,"d":"3,942 $"},{"v":4959,"d":"4,959 $"},1095,1314,1653,{"v":3832.5,"d":"3,833 $"},{"v":5785.5,"d":"5,786 $"}]
[38,"Isère","Auvergne-Rhône-Alpes","Riz",{"v":5286,"d":"5,286 $"},{"v":6342,"d":"6,342 $"},{"v":6354,"d":"6,354 $"},1762,2114,2118,{"v":5286,"d":"5,286 $"},{"v":6354,"d":"6,354 $"}]
[39,"Jura","Bourgogne-Franche-Comté","Riz",{"v":3642,"d":"3,642 $"},{"v":4368,"d":"4,368 $"},{"v":6720,"d":"6,720 $"},1214,1456,2240,{"v":3642,"d":"3,642 $"},{"v":6720,"d":"6,720 $"}]
[39,"Jura","Bourgogne-Franche-Comté","Sucre",{"v":1.9900000000000002,"d":"2 $"},{"v":1.9900000000000002,"d":"2 $"},{"v":2459.6400000000003,"d":"2,460 $"},1,1,1236,{"v":2,"d":"2 $"},{"v":2472,"d":"2,472 $"}]
[39,"Jura","Bourgogne-Franche-Comté","Lait",{"v":5958,"d":"5,958 $"},{"v":7149,"d":"7,149 $"},{"v":5760,"d":"5,760 $"},1986,2383,1920,{"v":6951,"d":"6,951 $"},{"v":6720,"d":"6,720 $"}]
[39,"Jura","Bourgogne-Franche-Comté","Yaourt",{"v":5334,"d":"5,334 $"},{"v":6400.5,"d":"6,401 $"},{"v":3660,"d":"3,660 $"},3556,4267,2440,{"v":5334,"d":"5,334 $"},{"v":3660,"d":"3,660 $"}]
[40,"Landes","Aquitaine-Limousin-Poitou-Charentes","Riz",{"v":909,"d":"909 $"},{"v":1089,"d":"1,089 $"},{"v":4899,"d":"4,899 $"},303,363,1633,{"v":909,"d":"909 $"},{"v":4899,"d":"4,899 $"}]
[40,"Landes","Aquitaine-Limousin-Poitou-Charentes","Fromage",{"v":2833.6000000000004,"d":"2,834 $"},{"v":3399.0000000000005,"d":"3,399 $"},{"v":4617.8,"d":"4,618 $"},1288,1545,2099,{"v":2962.3999999999996,"d":"2,962 $"},{"v":4827.7,"d":"4,828 $"}]
[40,"Landes","Aquitaine-Limousin-Poitou-Charentes","Sucre",{"v":4523.27,"d":"4,523 $"},{"v":5426.730000000001,"d":"5,427 $"},{"v":3474.54,"d":"3,475 $"},2273,2727,1746,{"v":4546,"d":"4,546 $"},{"v":3492,"d":"3,492 $"}]
[40,"Landes","Aquitaine-Limousin-Poitou-Charentes","Lait",{"v":10659,"d":"10,659 $"},{"v":12789,"d":"12,789 $"},{"v":2784,"d":"2,784 $"},3553,4263,928,{"v":12435.5,"d":"12,436 $"},{"v":3248,"d":"3,248 $"}]
[40,"Landes","Aquitaine-Limousin-Poitou-Charentes","Yaourt",{"v":2242.5,"d":"2,243 $"},{"v":2691,"d":"2,691 $"},{"v":1870.5,"d":"1,871 $"},1495,1794,1247,{"v":2242.5,"d":"2,243 $"},{"v":1870.5,"d":"1,871 $"}]
[42,"Loire","Auvergne-Rhône-Alpes","Sucre",{"v":2883.51,"d":"2,884 $"},{"v":3458.620000000001,"d":"3,459 $"},{"v":4254.620000000001,"d":"4,255 $"},1449,1738,2138,{"v":2898,"d":"2,898 $"},{"v":4276,"d":"4,276 $"}]
[42,"Loire","Auvergne-Rhône-Alpes","Lait",{"v":3960,"d":"3,960 $"},{"v":4752,"d":"4,752 $"},{"v":3987,"d":"3,987 $"},1320,1584,1329,{"v":4620,"d":"4,620 $"},{"v":4651.5,"d":"4,652 $"}]
[42,"Loire","Auvergne-Rhône-Alpes","Riz",{"v":3339,"d":"3,339 $"},{"v":4005,"d":"4,005 $"},{"v":7920,"d":"7,920 $"},1113,1335,2640,{"v":3339,"d":"3,339 $"},{"v":7920,"d":"7,920 $"}]
[42,"Loire","Auvergne-Rhône-Alpes","Fromage",{"v":7832.000000000001,"d":"7,832 $"},{"v":9398.400000000001,"d":"9,398 $"},{"v":5775.000000000001,"d":"5,775 $"},3560,4272,2625,{"v":8187.999999999999,"d":"8,188 $"},{"v":6037.499999999999,"d":"6,038 $"}]
[44,"Loire-Atlantique","Pays de la Loire","Riz",{"v":5457,"d":"5,457 $"},{"v":6546,"d":"6,546 $"},{"v":5934,"d":"5,934 $"},1819,2182,1978,{"v":5457,"d":"5,457 $"},{"v":5934,"d":"5,934 $"}]
[44,"Loire-Atlantique","Pays de la Loire","Fromage",{"v":220.00000000000003,"d":"220 $"},{"v":264,"d":"264 $"},{"v":3102.0000000000005,"d":"3,102 $"},100,120,1410,{"v":229.99999999999997,"d":"230 $"},{"v":3242.9999999999995,"d":"3,243 $"}]
[44,"Loire-Atlantique","Pays de la Loire","Lait",{"v":525,"d":"525 $"},{"v":630,"d":"630 $"},{"v":5418,"d":"5,418 $"},175,210,1806,{"v":612.5,"d":"613 $"},{"v":6321,"d":"6,321 $"}]
[44,"Loire-Atlantique","Pays de la Loire","Sucre",{"v":304.47,"d":"304 $"},{"v":364.1700000000001,"d":"364 $"},{"v":2268.6000000000004,"d":"2,269 $"},153,183,1140,{"v":306,"d":"306 $"},{"v":2280,"d":"2,280 $"}]
[44,"Loire-Atlantique","Pays de la Loire","Yaourt",{"v":2515.5,"d":"2,516 $"},{"v":3018,"d":"3,018 $"},{"v":3844.5,"d":"3,845 $"},1677,2012,2563,{"v":2515.5,"d":"2,516 $"},{"v":3844.5,"d":"3,845 $"}]
[45,"Loiret","Centre-Val de Loire","Sucre",{"v":5323.25,"d":"5,323 $"},{"v":6387.9000000000015,"d":"6,388 $"},{"v":5086.4400000000005,"d":"5,086 $"},2675,3210,2556,{"v":5350,"d":"5,350 $"},{"v":5112,"d":"5,112 $"}]
[45,"Loiret","Centre-Val de Loire","Lait",{"v":117,"d":"117 $"},{"v":138,"d":"138 $"},{"v":6408,"d":"6,408 $"},39,46,2136,{"v":136.5,"d":"137 $"},{"v":7476,"d":"7,476 $"}]
[45,"Loiret","Centre-Val de Loire","Riz",{"v":2097,"d":"2,097 $"},{"v":2514,"d":"2,514 $"},{"v":2670,"d":"2,670 $"},699,838,890,{"v":2097,"d":"2,097 $"},{"v":2670,"d":"2,670 $"}]
[45,"Loiret","Centre-Val de Loire","Fromage",{"v":5570.400000000001,"d":"5,570 $"},{"v":6683.6,"d":"6,684 $"},{"v":5612.200000000001,"d":"5,612 $"},2532,3038,2551,{"v":5823.599999999999,"d":"5,824 $"},{"v":5867.299999999999,"d":"5,867 $"}]
[41,"Loir-et-Cher","Centre-Val de Loire","Riz",{"v":10407,"d":"10,407 $"},{"v":12486,"d":"12,486 $"},{"v":2751,"d":"2,751 $"},3469,4162,917,{"v":10407,"d":"10,407 $"},{"v":2751,"d":"2,751 $"}]
[41,"Loir-et-Cher","Centre-Val de Loire","Sucre",{"v":5830.700000000001,"d":"5,831 $"},{"v":6996.84,"d":"6,997 $"},{"v":1566.13,"d":"1,566 $"},2930,3516,787,{"v":5860,"d":"5,860 $"},{"v":1574,"d":"1,574 $"}]
[41,"Loir-et-Cher","Centre-Val de Loire","Fromage",{"v":3781.8,"d":"3,782 $"},{"v":4536.400000000001,"d":"4,536 $"},{"v":3302.2000000000003,"d":"3,302 $"},1719,2062,1501,{"v":3953.7,"d":"3,954 $"},{"v":3452.2999999999997,"d":"3,452 $"}]
[41,"Loir-et-Cher","Centre-Val de Loire","Yaourt",{"v":4605,"d":"4,605 $"},{"v":5526,"d":"5,526 $"},{"v":2611.5,"d":"2,612 $"},3070,3684,1741,{"v":4605,"d":"4,605 $"},{"v":2611.5,"d":"2,612 $"}]
[46,"Lot","Languedoc-Roussillon-Midi-Pyrénées","Riz",{"v":6600,"d":"6,600 $"},{"v":7920,"d":"7,920 $"},{"v":2994,"d":"2,994 $"},2200,2640,998,{"v":6600,"d":"6,600 $"},{"v":2994,"d":"2,994 $"}]
[46,"Lot","Languedoc-Roussillon-Midi-Pyrénées","Sucre",{"v":1106.44,"d":"1,106 $"},{"v":1327.33,"d":"1,327 $"},{"v":4356.110000000001,"d":"4,356 $"},556,667,2189,{"v":1112,"d":"1,112 $"},{"v":4378,"d":"4,378 $"}]
[46,"Lot","Languedoc-Roussillon-Midi-Pyrénées","Lait",{"v":4365,"d":"4,365 $"},{"v":5238,"d":"5,238 $"},{"v":7320,"d":"7,320 $"},1455,1746,2440,{"v":5092.5,"d":"5,093 $"},{"v":8540,"d":"8,540 $"}]
[46,"Lot","Languedoc-Roussillon-Midi-Pyrénées","Fromage",{"v":3671.8,"d":"3,672 $"},{"v":4404.400000000001,"d":"4,404 $"},{"v":2780.8,"d":"2,781 $"},1669,2002,1264,{"v":3838.7,"d":"3,839 $"},{"v":2907.2,"d":"2,907 $"}]
[46,"Lot","Languedoc-Roussillon-Midi-Pyrénées","Yaourt",{"v":3492,"d":"3,492 $"},{"v":4189.5,"d":"4,190 $"},{"v":3556.5,"d":"3,557 $"},2328,2793,2371,{"v":3492,"d":"3,492 $"},{"v":3556.5,"d":"3,557 $"}]
[47,"Lot-et-Garonne","Aquitaine-Limousin-Poitou-Charentes","Yaourt",{"v":2773.5,"d":"2,774 $"},{"v":3327,"d":"3,327 $"},{"v":2505,"d":"2,505 $"},1849,2218,1670,{"v":2773.5,"d":"2,774 $"},{"v":2505,"d":"2,505 $"}]
[47,"Lot-et-Garonne","Aquitaine-Limousin-Poitou-Charentes","Fromage",{"v":169.4,"d":"169 $"},{"v":202.4,"d":"202 $"},{"v":3924.8,"d":"3,925 $"},77,92,1784,{"v":177.1,"d":"177 $"},{"v":4103.2,"d":"4,103 $"}]
[47,"Lot-et-Garonne","Aquitaine-Limousin-Poitou-Charentes","Sucre",{"v":815.9000000000001,"d":"816 $"},{"v":979.0800000000002,"d":"979 $"},{"v":4527.25,"d":"4,527 $"},410,492,2275,{"v":820,"d":"820 $"},{"v":4550,"d":"4,550 $"}]
[47,"Lot-et-Garonne","Aquitaine-Limousin-Poitou-Charentes","Riz",{"v":7146,"d":"7,146 $"},{"v":8574,"d":"8,574 $"},{"v":3000,"d":"3,000 $"},2382,2858,1000,{"v":7146,"d":"7,146 $"},{"v":3000,"d":"3,000 $"}]
[48,"Lozère","Languedoc-Roussillon-Midi-Pyrénées","Lait",{"v":1998,"d":"1,998 $"},{"v":2397,"d":"2,397 $"},{"v":6741,"d":"6,741 $"},666,799,2247,{"v":2331,"d":"2,331 $"},{"v":7864.5,"d":"7,865 $"}]
[48,"Lozère","Languedoc-Roussillon-Midi-Pyrénées","Fromage",{"v":1302.4,"d":"1,302 $"},{"v":1562.0000000000002,"d":"1,562 $"},{"v":2659.8,"d":"2,660 $"},592,710,1209,{"v":1361.6,"d":"1,362 $"},{"v":2780.7,"d":"2,781 $"}]
[48,"Lozère","Languedoc-Roussillon-Midi-Pyrénées","Riz",{"v":6381,"d":"6,381 $"},{"v":7656,"d":"7,656 $"},{"v":7821,"d":"7,821 $"},2127,2552,2607,{"v":6381,"d":"6,381 $"},{"v":7821,"d":"7,821 $"}]
[48,"Lozère","Languedoc-Roussillon-Midi-Pyrénées","Yaourt",{"v":727.5,"d":"728 $"},{"v":873,"d":"873 $"},{"v":2680.5,"d":"2,681 $"},485,582,1787,{"v":727.5,"d":"728 $"},{"v":2680.5,"d":"2,681 $"}]
[49,"Maine-et-Loire","Pays de la Loire","Riz",{"v":8088,"d":"8,088 $"},{"v":9705,"d":"9,705 $"},{"v":3936,"d":"3,936 $"},2696,3235,1312,{"v":8088,"d":"8,088 $"},{"v":3936,"d":"3,936 $"}]
[49,"Maine-et-Loire","Pays de la Loire","Yaourt",{"$f":"H259*VLOOKUP($D259,$Q$2:$S$6,3,0)-K259","v":{"v":4548,"d":"4,548 $"}},{"$f":"I259*VLOOKUP($D259,$Q$2:$S$6,3,0)-I259*VLOOKUP($D259,$Q$2:$S$6,2,0)","v":{"v":5457,"d":"5,457 $"}},{"$f":"J259*VLOOKUP($D259,$Q$2:$S$6,3,0)-L259","v":{"v":1375.5,"d":"1,376 $"}},3032,{"$f":"INT(H259*1.2)","v":3638},917,{"$f":"H259*VLOOKUP($D259,$Q$2:$S$6,2,0)","v":{"v":4548,"d":"4,548 $"}},{"$f":"J259*VLOOKUP($D259,$Q$2:$S$6,2,0)","v":{"v":1375.5,"d":"1,376 $"}}]
[49,"Maine-et-Loire","Pays de la Loire","Sucre",{"v":1796.9700000000003,"d":"1,797 $"},{"v":2155.17,"d":"2,155 $"},{"v":2302.4300000000003,"d":"2,302 $"},903,1083,1157,{"v":1806,"d":"1,806 $"},{"v":2314,"d":"2,314 $"}]
[49,"Maine-et-Loire","Pays de la Loire","Fromage",{"v":1513.6000000000001,"d":"1,514 $"},{"v":1815.0000000000002,"d":"1,815 $"},{"v":5946.6,"d":"5,947 $"},688,825,2703,{"v":1582.3999999999999,"d":"1,582 $"},{"v":6216.9,"d":"6,217 $"}]
[49,"Maine-et-Loire","Pays de la Loire","Lait",{"v":9288,"d":"9,288 $"},{"v":11145,"d":"11,145 $"},{"v":3621,"d":"3,621 $"},3096,3715,1207,{"v":10836,"d":"10,836 $"},{"v":4224.5,"d":"4,225 $"}]
[50,"Manche","Normandie","Riz",{"v":447,"d":"447 $"},{"v":534,"d":"534 $"},{"v":3393,"d":"3,393 $"},149,178,1131,{"v":447,"d":"447 $"},{"v":3393,"d":"3,393 $"}]
[50,"Manche","Normandie","Lait",{"v":7566,"d":"7,566 $"},{"v":9078,"d":"9,078 $"},{"v":4413,"d":"4,413 $"},2522,3026,1471,{"v":8827,"d":"8,827 $"},{"v":5148.5,"d":"5,149 $"}]
[50,"Manche","Normandie","Fromage",{"v":1144,"d":"1,144 $"},{"v":1372.8000000000002,"d":"1,373 $"},{"v":3344.0000000000005,"d":"3,344 $"},520,624,1520,{"v":1196,"d":"1,196 $"},{"v":3495.9999999999995,"d":"3,496 $"}]
[50,"Manche","Normandie","Sucre",{"v":3026.79,"d":"3,027 $"},{"v":3631.75,"d":"3,632 $"},{"v":4921.27,"d":"4,921 $"},1521,1825,2473,{"v":3042,"d":"3,042 $"},{"v":4946,"d":"4,946 $"}]
[50,"Manche","Normandie","Yaourt",{"v":5530.5,"d":"5,531 $"},{"v":6636,"d":"6,636 $"},{"v":2328,"d":"2,328 $"},3687,4424,1552,{"v":5530.5,"d":"5,531 $"},{"v":2328,"d":"2,328 $"}]
[51,"Marne","Alsace-Champagne-Ardenne-Lorraine","Fromage",{"v":3368.2000000000003,"d":"3,368 $"},{"v":4041.4000000000005,"d":"4,041 $"},{"v":5313,"d":"5,313 $"},1531,1837,2415,{"v":3521.2999999999997,"d":"3,521 $"},{"v":5554.5,"d":"5,555 $"}]
[51,"Marne","Alsace-Champagne-Ardenne-Lorraine","Sucre",{"v":923.3600000000001,"d":"923 $"},{"v":1106.44,"d":"1,106 $"},{"v":3174.05,"d":"3,174 $"},464,556,1595,{"v":928,"d":"928 $"},{"v":3190,"d":"3,190 $"}]
[51,"Marne","Alsace-Champagne-Ardenne-Lorraine","Lait",{"v":6135,"d":"6,135 $"},{"v":7362,"d":"7,362 $"},{"v":6567,"d":"6,567 $"},2045,2454,2189,{"v":7157.5,"d":"7,158 $"},{"v":7661.5,"d":"7,662 $"}]
[51,"Marne","Alsace-Champagne-Ardenne-Lorraine","Riz",{"v":3366,"d":"3,366 $"},{"v":4038,"d":"4,038 $"},{"v":8106,"d":"8,106 $"},1122,1346,2702,{"v":3366,"d":"3,366 $"},{"v":8106,"d":"8,106 $"}]
[53,"Mayenne","Pays de la Loire","Yaourt",{"v":1278,"d":"1,278 $"},{"v":1533,"d":"1,533 $"},{"v":2965.5,"d":"2,966 $"},852,1022,1977,{"v":1278,"d":"1,278 $"},{"v":2965.5,"d":"2,966 $"}]
[53,"Mayenne","Pays de la Loire","Lait",{"v":528,"d":"528 $"},{"v":633,"d":"633 $"},{"v":6048,"d":"6,048 $"},176,211,2016,{"v":616,"d":"616 $"},{"v":7056,"d":"7,056 $"}]
[53,"Mayenne","Pays de la Loire","Fromage",{"v":3916.0000000000005,"d":"3,916 $"},{"v":4699.200000000001,"d":"4,699 $"},{"v":2470.6000000000004,"d":"2,471 $"},1780,2136,1123,{"v":4093.9999999999995,"d":"4,094 $"},{"v":2582.8999999999996,"d":"2,583 $"}]
[53,"Mayenne","Pays de la Loire","Sucre",{"v":232.83000000000004,"d":"233 $"},{"v":278.6,"d":"279 $"},{"v":3983.9800000000005,"d":"3,984 $"},117,140,2002,{"v":234,"d":"234 $"},{"v":4004,"d":"4,004 $"}]
[53,"Mayenne","Pays de la Loire","Riz",{"v":7863,"d":"7,863 $"},{"v":9435,"d":"9,435 $"},{"v":6693,"d":"6,693 $"},2621,3145,2231,{"v":7863,"d":"7,863 $"},{"v":6693,"d":"6,693 $"}]
[54,"Meurthe-et-Moselle","Alsace-Champagne-Ardenne-Lorraine","Fromage",{"v":7409.6,"d":"7,410 $"},{"v":8890.2,"d":"8,890 $"},{"v":2615.8,"d":"2,616 $"},3368,4041,1189,{"v":7746.4,"d":"7,746 $"},{"v":2734.7,"d":"2,735 $"}]
[54,"Meurthe-et-Moselle","Alsace-Champagne-Ardenne-Lorraine","Riz",{"v":8085,"d":"8,085 $"},{"v":9702,"d":"9,702 $"},{"v":3879,"d":"3,879 $"},2695,3234,1293,{"v":8085,"d":"8,085 $"},{"v":3879,"d":"3,879 $"}]
[54,"Meurthe-et-Moselle","Alsace-Champagne-Ardenne-Lorraine","Sucre",{"v":5267.530000000001,"d":"5,268 $"},{"v":6320.24,"d":"6,320 $"},{"v":2628.79,"d":"2,629 $"},2647,3176,1321,{"v":5294,"d":"5,294 $"},{"v":2642,"d":"2,642 $"}]
[54,"Meurthe-et-Moselle","Alsace-Champagne-Ardenne-Lorraine","Lait",{"v":5115,"d":"5,115 $"},{"v":6138,"d":"6,138 $"},{"v":4083,"d":"4,083 $"},1705,2046,1361,{"v":5967.5,"d":"5,968 $"},{"v":4763.5,"d":"4,764 $"}]
[54,"Meurthe-et-Moselle","Alsace-Champagne-Ardenne-Lorraine","Yaourt",{"v":3660,"d":"3,660 $"},{"v":4392,"d":"4,392 $"},{"v":1392,"d":"1,392 $"},2440,2928,928,{"v":3660,"d":"3,660 $"},{"v":1392,"d":"1,392 $"}]
[55,"Meuse","Alsace-Champagne-Ardenne-Lorraine","Riz",{"v":2838,"d":"2,838 $"},{"v":3405,"d":"3,405 $"},{"v":6315,"d":"6,315 $"},946,1135,2105,{"v":2838,"d":"2,838 $"},{"v":6315,"d":"6,315 $"}]
[55,"Meuse","Alsace-Champagne-Ardenne-Lorraine","Sucre",{"v":7920.200000000001,"d":"7,920 $"},{"v":9504.240000000002,"d":"9,504 $"},{"v":4441.68,"d":"4,442 $"},3980,4776,2232,{"v":7960,"d":"7,960 $"},{"v":4464,"d":"4,464 $"}]
[55,"Meuse","Alsace-Champagne-Ardenne-Lorraine","Lait",{"v":9807,"d":"9,807 $"},{"v":11766,"d":"11,766 $"},{"v":4101,"d":"4,101 $"},3269,3922,1367,{"v":11441.5,"d":"11,442 $"},{"v":4784.5,"d":"4,785 $"}]
[55,"Meuse","Alsace-Champagne-Ardenne-Lorraine","Fromage",{"v":7961.800000000001,"d":"7,962 $"},{"v":9552.400000000001,"d":"9,552 $"},{"v":3458.4,"d":"3,458 $"},3619,4342,1572,{"v":8323.699999999999,"d":"8,324 $"},{"v":3615.6,"d":"3,616 $"}]
[55,"Meuse","Alsace-Champagne-Ardenne-Lorraine","Yaourt",{"v":678,"d":"678 $"},{"v":813,"d":"813 $"},{"v":1744.5,"d":"1,745 $"},452,542,1163,{"v":678,"d":"678 $"},{"v":1744.5,"d":"1,745 $"}]
[56,"Morbihan","Bretagne","Lait",{"v":3102,"d":"3,102 $"},{"v":3720,"d":"3,720 $"},{"v":7041,"d":"7,041 $"},1034,1240,2347,{"v":3619,"d":"3,619 $"},{"v":8214.5,"d":"8,215 $"}]
[56,"Morbihan","Bretagne","Yaourt",{"v":3787.5,"d":"3,788 $"},{"v":4545,"d":"4,545 $"},{"v":2284.5,"d":"2,285 $"},2525,3030,1523,{"v":3787.5,"d":"3,788 $"},{"v":2284.5,"d":"2,285 $"}]
[56,"Morbihan","Bretagne","Fromage",{"v":4571.6,"d":"4,572 $"},{"v":5484.6,"d":"5,485 $"},{"v":4340.6,"d":"4,341 $"},2078,2493,1973,{"v":4779.4,"d":"4,779 $"},{"v":4537.9,"d":"4,538 $"}]
[56,"Morbihan","Bretagne","Sucre",{"v":5239.67,"d":"5,240 $"},{"v":6286.41,"d":"6,286 $"},{"v":5303.35,"d":"5,303 $"},2633,3159,2665,{"v":5266,"d":"5,266 $"},{"v":5330,"d":"5,330 $"}]
[57,"Moselle","Alsace-Champagne-Ardenne-Lorraine","Riz",{"v":1272,"d":"1,272 $"},{"v":1524,"d":"1,524 $"},{"v":7449,"d":"7,449 $"},424,508,2483,{"v":1272,"d":"1,272 $"},{"v":7449,"d":"7,449 $"}]
[57,"Moselle","Alsace-Champagne-Ardenne-Lorraine","Fromage",{"v":2516.8,"d":"2,517 $"},{"v":3018.4,"d":"3,018 $"},{"v":4004,"d":"4,004 $"},1144,1372,1820,{"v":2631.2,"d":"2,631 $"},{"v":4186,"d":"4,186 $"}]
[57,"Moselle","Alsace-Champagne-Ardenne-Lorraine","Yaourt",{"v":142.5,"d":"143 $"},{"v":171,"d":"171 $"},{"v":1287,"d":"1,287 $"},95,114,858,{"v":142.5,"d":"143 $"},{"v":1287,"d":"1,287 $"}]
[57,"Moselle","Alsace-Champagne-Ardenne-Lorraine","Sucre",{"v":5635.68,"d":"5,636 $"},{"v":6762.02,"d":"6,762 $"},{"v":5136.1900000000005,"d":"5,136 $"},2832,3398,2581,{"v":5664,"d":"5,664 $"},{"v":5162,"d":"5,162 $"}]
[58,"Nièvre","Bourgogne-Franche-Comté","Sucre",{"v":7892.34,"d":"7,892 $"},{"v":9470.41,"d":"9,470 $"},{"v":2571.08,"d":"2,571 $"},3966,4759,1292,{"v":7932,"d":"7,932 $"},{"v":2584,"d":"2,584 $"}]
[58,"Nièvre","Bourgogne-Franche-Comté","Yaourt",{"v":1939.5,"d":"1,940 $"},{"v":2326.5,"d":"2,327 $"},{"v":2044.5,"d":"2,045 $"},1293,1551,1363,{"v":1939.5,"d":"1,940 $"},{"v":2044.5,"d":"2,045 $"}]
[58,"Nièvre","Bourgogne-Franche-Comté","Riz",{"v":6168,"d":"6,168 $"},{"v":7401,"d":"7,401 $"},{"v":4596,"d":"4,596 $"},2056,2467,1532,{"v":6168,"d":"6,168 $"},{"v":4596,"d":"4,596 $"}]
[58,"Nièvre","Bourgogne-Franche-Comté","Fromage",{"v":3291.2000000000003,"d":"3,291 $"},{"v":3949,"d":"3,949 $"},{"v":2543.2000000000003,"d":"2,543 $"},1496,1795,1156,{"v":3440.7999999999997,"d":"3,441 $"},{"v":2658.7999999999997,"d":"2,659 $"}]
[59,"Nord","Nord-Pas-de-Calais-Picardie","Sucre",{"v":421.88,"d":"422 $"},{"v":505.46000000000004,"d":"505 $"},{"v":2724.3100000000004,"d":"2,724 $"},212,254,1369,{"v":424,"d":"424 $"},{"v":2738,"d":"2,738 $"}]
[59,"Nord","Nord-Pas-de-Calais-Picardie","Riz",{"v":909,"d":"909 $"},{"v":1089,"d":"1,089 $"},{"v":6684,"d":"6,684 $"},303,363,2228,{"v":909,"d":"909 $"},{"v":6684,"d":"6,684 $"}]
[59,"Nord","Nord-Pas-de-Calais-Picardie","Lait",{"v":5913,"d":"5,913 $"},{"v":7095,"d":"7,095 $"},{"v":4878,"d":"4,878 $"},1971,2365,1626,{"v":6898.5,"d":"6,899 $"},{"v":5691,"d":"5,691 $"}]
[59,"Nord","Nord-Pas-de-Calais-Picardie","Yaourt",{"v":2652,"d":"2,652 $"},{"v":3181.5,"d":"3,182 $"},{"v":2254.5,"d":"2,255 $"},1768,2121,1503,{"v":2652,"d":"2,652 $"},{"v":2254.5,"d":"2,255 $"}]
[59,"Nord","Nord-Pas-de-Calais-Picardie","Fromage",{"v":4694.8,"d":"4,695 $"},{"v":5632,"d":"5,632 $"},{"v":3733.4,"d":"3,733 $"},2134,2560,1697,{"v":4908.2,"d":"4,908 $"},{"v":3903.1,"d":"3,903 $"}]
[60,"Oise","Nord-Pas-de-Calais-Picardie","Riz",{"v":8238,"d":"8,238 $"},{"v":9885,"d":"9,885 $"},{"v":7251,"d":"7,251 $"},2746,3295,2417,{"v":8238,"d":"8,238 $"},{"v":7251,"d":"7,251 $"}]
[60,"Oise","Nord-Pas-de-Calais-Picardie","Fromage",{"v":2197.8,"d":"2,198 $"},{"v":2635.6000000000004,"d":"2,636 $"},{"v":1966.8000000000002,"d":"1,967 $"},999,1198,894,{"v":2297.7,"d":"2,298 $"},{"v":2056.2,"d":"2,056 $"}]
[60,"Oise","Nord-Pas-de-Calais-Picardie","Yaourt",{"v":3285,"d":"3,285 $"},{"v":3942,"d":"3,942 $"},{"v":1606.5,"d":"1,607 $"},2190,2628,1071,{"v":3285,"d":"3,285 $"},{"v":1606.5,"d":"1,607 $"}]
[60,"Oise","Nord-Pas-de-Calais-Picardie","Lait",{"v":600,"d":"600 $"},{"v":720,"d":"720 $"},{"v":5100,"d":"5,100 $"},200,240,1700,{"v":700,"d":"700 $"},{"v":5950,"d":"5,950 $"}]
[61,"Orne","Normandie","Yaourt",{"v":456,"d":"456 $"},{"v":546,"d":"546 $"},{"v":3882,"d":"3,882 $"},304,364,2588,{"v":456,"d":"456 $"},{"v":3882,"d":"3,882 $"}]
[61,"Orne","Normandie","Fromage",{"v":2101,"d":"2,101 $"},{"v":2521.2000000000003,"d":"2,521 $"},{"v":4239.400000000001,"d":"4,239 $"},955,1146,1927,{"v":2196.5,"d":"2,197 $"},{"v":4432.099999999999,"d":"4,432 $"}]
[61,"Orne","Normandie","Lait",{"v":9669,"d":"9,669 $"},{"v":11601,"d":"11,601 $"},{"v":7944,"d":"7,944 $"},3223,3867,2648,{"v":11280.5,"d":"11,281 $"},{"v":9268,"d":"9,268 $"}]
[61,"Orne","Normandie","Sucre",{"v":4994.9,"d":"4,995 $"},{"v":5993.880000000001,"d":"5,994 $"},{"v":1830.8000000000002,"d":"1,831 $"},2510,3012,920,{"v":5020,"d":"5,020 $"},{"v":1840,"d":"1,840 $"}]
[61,"Orne","Normandie","Riz",{"v":9543,"d":"9,543 $"},{"v":11451,"d":"11,451 $"},{"v":3846,"d":"3,846 $"},3181,3817,1282,{"v":9543,"d":"9,543 $"},{"v":3846,"d":"3,846 $"}]
[75,"Paris","Île-de-France","Sucre",{"v":2841.7200000000003,"d":"2,842 $"},{"v":3408.870000000001,"d":"3,409 $"},{"v":2992.96,"d":"2,993 $"},1428,1713,1504,{"v":2856,"d":"2,856 $"},{"v":3008,"d":"3,008 $"}]
[75,"Paris","Île-de-France","Lait",{"v":6207,"d":"6,207 $"},{"v":7446,"d":"7,446 $"},{"v":5064,"d":"5,064 $"},2069,2482,1688,{"v":7241.5,"d":"7,242 $"},{"v":5908,"d":"5,908 $"}]
[75,"Paris","Île-de-France","Fromage",{"v":1234.2,"d":"1,234 $"},{"v":1480.6000000000001,"d":"1,481 $"},{"v":2591.6000000000004,"d":"2,592 $"},561,673,1178,{"v":1290.3,"d":"1,290 $"},{"v":2709.3999999999996,"d":"2,709 $"}]
[75,"Paris","Île-de-France","Yaourt",{"v":1333.5,"d":"1,334 $"},{"v":1599,"d":"1,599 $"},{"v":3696,"d":"3,696 $"},889,1066,2464,{"v":1333.5,"d":"1,334 $"},{"v":3696,"d":"3,696 $"}]
[62,"Pas-de-Calais","Nord-Pas-de-Calais-Picardie","Fromage",{"v":4166.8,"d":"4,167 $"},{"v":4998.400000000001,"d":"4,998 $"},{"v":3808.2000000000003,"d":"3,808 $"},1894,2272,1731,{"v":4356.2,"d":"4,356 $"},{"v":3981.2999999999997,"d":"3,981 $"}]
[62,"Pas-de-Calais","Nord-Pas-de-Calais-Picardie","Lait",{"v":420,"d":"420 $"},{"v":504,"d":"504 $"},{"v":4398,"d":"4,398 $"},140,168,1466,{"v":490,"d":"490 $"},{"v":5131,"d":"5,131 $"}]
[62,"Pas-de-Calais","Nord-Pas-de-Calais-Picardie","Riz",{"v":1395,"d":"1,395 $"},{"v":1674,"d":"1,674 $"},{"v":2406,"d":"2,406 $"},465,558,802,{"v":1395,"d":"1,395 $"},{"v":2406,"d":"2,406 $"}]
[62,"Pas-de-Calais","Nord-Pas-de-Calais-Picardie","Yaourt",{"v":627,"d":"627 $"},{"v":751.5,"d":"752 $"},{"v":1996.5,"d":"1,997 $"},418,501,1331,{"v":627,"d":"627 $"},{"v":1996.5,"d":"1,997 $"}]
[62,"Pas-de-Calais","Nord-Pas-de-Calais-Picardie","Sucre",{"v":612.9200000000001,"d":"613 $"},{"v":734.3100000000002,"d":"734 $"},{"v":1862.6400000000003,"d":"1,863 $"},308,369,936,{"v":616,"d":"616 $"},{"v":1872,"d":"1,872 $"}]
[63,"Puy-de-Dôme","Auvergne-Rhône-Alpes","Riz",{"v":4107,"d":"4,107 $"},{"v":4926,"d":"4,926 $"},{"v":5274,"d":"5,274 $"},1369,1642,1758,{"v":4107,"d":"4,107 $"},{"v":5274,"d":"5,274 $"}]
[63,"Puy-de-Dôme","Auvergne-Rhône-Alpes","Fromage",{"$f":"H323*VLOOKUP($D323,$Q$2:$S$6,3,0)-K323","v":{"v":6721.000000000001,"d":"6,721 $"}},{"$f":"I323*VLOOKUP($D323,$Q$2:$S$6,3,0)-I323*VLOOKUP($D323,$Q$2:$S$6,2,0)","v":{"v":8065.200000000001,"d":"8,065 $"}},{"$f":"J323*VLOOKUP($D323,$Q$2:$S$6,3,0)-L323","v":{"v":4908.200000000001,"d":"4,908 $"}},3055,{"$f":"INT(H323*1.2)","v":3666},2231,{"$f":"H323*VLOOKUP($D323,$Q$2:$S$6,2,0)","v":{"v":7026.499999999999,"d":"7,027 $"}},{"$f":"J323*VLOOKUP($D323,$Q$2:$S$6,2,0)","v":{"v":5131.299999999999,"d":"5,131 $"}}]
[63,"Puy-de-Dôme","Auvergne-Rhône-Alpes","Sucre",{"v":411.93000000000006,"d":"412 $"},{"v":493.5200000000001,"d":"494 $"},{"v":1767.1200000000003,"d":"1,767 $"},207,248,888,{"v":414,"d":"414 $"},{"v":1776,"d":"1,776 $"}]
[64,"Pyrénées-Atlantiques","Aquitaine-Limousin-Poitou-Charentes","Lait",{"v":111,"d":"111 $"},{"v":132,"d":"132 $"},{"v":5127,"d":"5,127 $"},37,44,1709,{"v":129.5,"d":"130 $"},{"v":5981.5,"d":"5,982 $"}]
[64,"Pyrénées-Atlantiques","Aquitaine-Limousin-Poitou-Charentes","Fromage",{"v":1793.0000000000002,"d":"1,793 $"},{"v":2151.6000000000004,"d":"2,152 $"},{"v":5273.400000000001,"d":"5,273 $"},815,978,2397,{"v":1874.4999999999998,"d":"1,875 $"},{"v":5513.099999999999,"d":"5,513 $"}]
[64,"Pyrénées-Atlantiques","Aquitaine-Limousin-Poitou-Charentes","Sucre",{"v":871.6200000000001,"d":"872 $"},{"v":1044.75,"d":"1,045 $"},{"v":2173.08,"d":"2,173 $"},438,525,1092,{"v":876,"d":"876 $"},{"v":2184,"d":"2,184 $"}]
[64,"Pyrénées-Atlantiques","Aquitaine-Limousin-Poitou-Charentes","Riz",{"v":5832,"d":"5,832 $"},{"v":6996,"d":"6,996 $"},{"v":6375,"d":"6,375 $"},1944,2332,2125,{"v":5832,"d":"5,832 $"},{"v":6375,"d":"6,375 $"}]
[64,"Pyrénées-Atlantiques","Aquitaine-Limousin-Poitou-Charentes","Yaourt",{"v":2944.5,"d":"2,945 $"},{"v":3532.5,"d":"3,533 $"},{"v":2331,"d":"2,331 $"},1963,2355,1554,{"v":2944.5,"d":"2,945 $"},{"v":2331,"d":"2,331 $"}]
[66,"Pyrénées-Orientales","Languedoc-Roussillon-Midi-Pyrénées","Yaourt",{"v":1683,"d":"1,683 $"},{"v":2019,"d":"2,019 $"},{"v":1695,"d":"1,695 $"},1122,1346,1130,{"v":1683,"d":"1,683 $"},{"v":1695,"d":"1,695 $"}]
[66,"Pyrénées-Orientales","Languedoc-Roussillon-Midi-Pyrénées","Fromage",{"v":2494.8,"d":"2,495 $"},{"v":2992.0000000000005,"d":"2,992 $"},{"v":4483.6,"d":"4,484 $"},1134,1360,2038,{"v":2608.2,"d":"2,608 $"},{"v":4687.4,"d":"4,687 $"}]
[66,"Pyrénées-Orientales","Languedoc-Roussillon-Midi-Pyrénées","Sucre",{"v":216.91000000000003,"d":"217 $"},{"v":258.70000000000005,"d":"259 $"},{"v":4535.210000000001,"d":"4,535 $"},109,130,2279,{"v":218,"d":"218 $"},{"v":4558,"d":"4,558 $"}]
[66,"Pyrénées-Orientales","Languedoc-Roussillon-Midi-Pyrénées","Lait",{"v":1188,"d":"1,188 $"},{"v":1425,"d":"1,425 $"},{"v":6642,"d":"6,642 $"},396,475,2214,{"v":1386,"d":"1,386 $"},{"v":7749,"d":"7,749 $"}]
[66,"Pyrénées-Orientales","Languedoc-Roussillon-Midi-Pyrénées","Riz",{"v":6843,"d":"6,843 $"},{"v":8211,"d":"8,211 $"},{"v":2901,"d":"2,901 $"},2281,2737,967,{"v":6843,"d":"6,843 $"},{"v":2901,"d":"2,901 $"}]
[69,"Rhône","Auvergne-Rhône-Alpes","Sucre",{"v":1796.9700000000003,"d":"1,797 $"},{"v":2155.17,"d":"2,155 $"},{"v":5299.370000000001,"d":"5,299 $"},903,1083,2663,{"v":1806,"d":"1,806 $"},{"v":5326,"d":"5,326 $"}]
[69,"Rhône","Auvergne-Rhône-Alpes","Riz",{"v":5205,"d":"5,205 $"},{"v":6246,"d":"6,246 $"},{"v":2607,"d":"2,607 $"},1735,2082,869,{"v":5205,"d":"5,205 $"},{"v":2607,"d":"2,607 $"}]
[69,"Rhône","Auvergne-Rhône-Alpes","Yaourt",{"v":199.5,"d":"200 $"},{"v":238.5,"d":"239 $"},{"v":3963,"d":"3,963 $"},133,159,2642,{"v":199.5,"d":"200 $"},{"v":3963,"d":"3,963 $"}]
[69,"Rhône","Auvergne-Rhône-Alpes","Lait",{"v":552,"d":"552 $"},{"v":660,"d":"660 $"},{"v":4302,"d":"4,302 $"},184,220,1434,{"v":644,"d":"644 $"},{"v":5019,"d":"5,019 $"}]
[71,"Saône-et-Loire","Bourgogne-Franche-Comté","Sucre",{"v":2391.9800000000005,"d":"2,392 $"},{"v":2869.58,"d":"2,870 $"},{"v":5146.140000000001,"d":"5,146 $"},1202,1442,2586,{"v":2404,"d":"2,404 $"},{"v":5172,"d":"5,172 $"}]
[71,"Saône-et-Loire","Bourgogne-Franche-Comté","Lait",{"v":3051,"d":"3,051 $"},{"v":3660,"d":"3,660 $"},{"v":3795,"d":"3,795 $"},1017,1220,1265,{"v":3559.5,"d":"3,560 $"},{"v":4427.5,"d":"4,428 $"}]
[71,"Saône-et-Loire","Bourgogne-Franche-Comté","Fromage",{"v":5425.200000000001,"d":"5,425 $"},{"v":6509.8,"d":"6,510 $"},{"v":3863.2000000000003,"d":"3,863 $"},2466,2959,1756,{"v":5671.799999999999,"d":"5,672 $"},{"v":4038.7999999999997,"d":"4,039 $"}]
[71,"Saône-et-Loire","Bourgogne-Franche-Comté","Riz",{"v":234,"d":"234 $"},{"v":279,"d":"279 $"},{"v":2775,"d":"2,775 $"},78,93,925,{"v":234,"d":"234 $"},{"v":2775,"d":"2,775 $"}]
[71,"Saône-et-Loire","Bourgogne-Franche-Comté","Yaourt",{"v":738,"d":"738 $"},{"v":885,"d":"885 $"},{"v":2796,"d":"2,796 $"},492,590,1864,{"v":738,"d":"738 $"},{"v":2796,"d":"2,796 $"}]
[72,"Sarthe","Pays de la Loire","Riz",{"v":3975,"d":"3,975 $"},{"v":4770,"d":"4,770 $"},{"v":5511,"d":"5,511 $"},1325,1590,1837,{"v":3975,"d":"3,975 $"},{"v":5511,"d":"5,511 $"}]
[72,"Sarthe","Pays de la Loire","Lait",{"v":4404,"d":"4,404 $"},{"v":5283,"d":"5,283 $"},{"v":4941,"d":"4,941 $"},1468,1761,1647,{"v":5138,"d":"5,138 $"},{"v":5764.5,"d":"5,765 $"}]
[72,"Sarthe","Pays de la Loire","Yaourt",{"v":112.5,"d":"113 $"},{"v":135,"d":"135 $"},{"v":2863.5,"d":"2,864 $"},75,90,1909,{"v":112.5,"d":"113 $"},{"v":2863.5,"d":"2,864 $"}]
[72,"Sarthe","Pays de la Loire","Sucre",{"v":4640.68,"d":"4,641 $"},{"v":5568.02,"d":"5,568 $"},{"v":5026.74,"d":"5,027 $"},2332,2798,2526,{"v":4664,"d":"4,664 $"},{"v":5052,"d":"5,052 $"}]
[72,"Sarthe","Pays de la Loire","Fromage",{"v":6091.8,"d":"6,092 $"},{"v":7308.400000000001,"d":"7,308 $"},{"v":4833.400000000001,"d":"4,833 $"},2769,3322,2197,{"v":6368.7,"d":"6,369 $"},{"v":5053.099999999999,"d":"5,053 $"}]
[73,"Savoie","Auvergne-Rhône-Alpes","Lait",{"v":6174,"d":"6,174 $"},{"v":7407,"d":"7,407 $"},{"v":7599,"d":"7,599 $"},2058,2469,2533,{"v":7203,"d":"7,203 $"},{"v":8865.5,"d":"8,866 $"}]
[73,"Savoie","Auvergne-Rhône-Alpes","Riz",{"v":1104,"d":"1,104 $"},{"v":1323,"d":"1,323 $"},{"v":6606,"d":"6,606 $"},368,441,2202,{"v":1104,"d":"1,104 $"},{"v":6606,"d":"6,606 $"}]
[73,"Savoie","Auvergne-Rhône-Alpes","Fromage",{"v":3319.8,"d":"3,320 $"},{"v":3982,"d":"3,982 $"},{"v":4131.6,"d":"4,132 $"},1509,1810,1878,{"v":3470.7,"d":"3,471 $"},{"v":4319.4,"d":"4,319 $"}]
[73,"Savoie","Auvergne-Rhône-Alpes","Yaourt",{"v":228,"d":"228 $"},{"v":273,"d":"273 $"},{"v":3471,"d":"3,471 $"},152,182,2314,{"v":228,"d":"228 $"},{"v":3471,"d":"3,471 $"}]
[77,"Seine-et-Marne","Île-de-France","Lait",{"v":8757,"d":"8,757 $"},{"v":10506,"d":"10,506 $"},{"v":3645,"d":"3,645 $"},2919,3502,1215,{"v":10216.5,"d":"10,217 $"},{"v":4252.5,"d":"4,253 $"}]
[77,"Seine-et-Marne","Île-de-France","Sucre",{"v":2873.5600000000004,"d":"2,874 $"},{"v":3446.6800000000003,"d":"3,447 $"},{"v":2105.42,"d":"2,105 $"},1444,1732,1058,{"v":2888,"d":"2,888 $"},{"v":2116,"d":"2,116 $"}]
[77,"Seine-et-Marne","Île-de-France","Yaourt",{"v":4606.5,"d":"4,607 $"},{"v":5527.5,"d":"5,528 $"},{"v":2626.5,"d":"2,627 $"},3071,3685,1751,{"v":4606.5,"d":"4,607 $"},{"v":2626.5,"d":"2,627 $"}]
[76,"Seine-Maritime","Normandie","Sucre",{"v":1902.44,"d":"1,902 $"},{"v":2282.5300000000007,"d":"2,283 $"},{"v":3777.0200000000004,"d":"3,777 $"},956,1147,1898,{"v":1912,"d":"1,912 $"},{"v":3796,"d":"3,796 $"}]
[76,"Seine-Maritime","Normandie","Riz",{"v":1317,"d":"1,317 $"},{"v":1578,"d":"1,578 $"},{"v":3837,"d":"3,837 $"},439,526,1279,{"v":1317,"d":"1,317 $"},{"v":3837,"d":"3,837 $"}]
[76,"Seine-Maritime","Normandie","Lait",{"v":10176,"d":"10,176 $"},{"v":12210,"d":"12,210 $"},{"v":4902,"d":"4,902 $"},3392,4070,1634,{"v":11872,"d":"11,872 $"},{"v":5719,"d":"5,719 $"}]
[76,"Seine-Maritime","Normandie","Yaourt",{"v":3277.5,"d":"3,278 $"},{"v":3933,"d":"3,933 $"},{"v":1927.5,"d":"1,928 $"},2185,2622,1285,{"v":3277.5,"d":"3,278 $"},{"v":1927.5,"d":"1,928 $"}]
[93,"Seine-Saint-Denis","Île-de-France","Lait",{"v":9717,"d":"9,717 $"},{"v":11658,"d":"11,658 $"},{"v":5403,"d":"5,403 $"},3239,3886,1801,{"v":11336.5,"d":"11,337 $"},{"v":6303.5,"d":"6,304 $"}]
[93,"Seine-Saint-Denis","Île-de-France","Fromage",{"v":1493.8000000000002,"d":"1,494 $"},{"v":1790.8000000000002,"d":"1,791 $"},{"v":5031.400000000001,"d":"5,031 $"},679,814,2287,{"v":1561.6999999999998,"d":"1,562 $"},{"v":5260.099999999999,"d":"5,260 $"}]
[93,"Seine-Saint-Denis","Île-de-France","Riz",{"v":4329,"d":"4,329 $"},{"v":5193,"d":"5,193 $"},{"v":7041,"d":"7,041 $"},1443,1731,2347,{"v":4329,"d":"4,329 $"},{"v":7041,"d":"7,041 $"}]
[93,"Seine-Saint-Denis","Île-de-France","Yaourt",{"v":4084.5,"d":"4,085 $"},{"v":4900.5,"d":"4,901 $"},{"v":2035.5,"d":"2,036 $"},2723,3267,1357,{"v":4084.5,"d":"4,085 $"},{"v":2035.5,"d":"2,036 $"}]
[80,"Somme","Nord-Pas-de-Calais-Picardie","Lait",{"v":5106,"d":"5,106 $"},{"v":6126,"d":"6,126 $"},{"v":6207,"d":"6,207 $"},1702,2042,2069,{"v":5957,"d":"5,957 $"},{"v":7241.5,"d":"7,242 $"}]
[80,"Somme","Nord-Pas-de-Calais-Picardie","Fromage",{"v":1797.4,"d":"1,797 $"},{"v":2156,"d":"2,156 $"},{"v":5445,"d":"5,445 $"},817,980,2475,{"v":1879.1,"d":"1,879 $"},{"v":5692.5,"d":"5,693 $"}]
[80,"Somme","Nord-Pas-de-Calais-Picardie","Riz",{"v":4878,"d":"4,878 $"},{"v":5853,"d":"5,853 $"},{"v":5730,"d":"5,730 $"},1626,1951,1910,{"v":4878,"d":"4,878 $"},{"v":5730,"d":"5,730 $"}]
[80,"Somme","Nord-Pas-de-Calais-Picardie","Sucre",{"v":2465.6100000000006,"d":"2,466 $"},{"v":2957.1400000000003,"d":"2,957 $"},{"v":2823.8100000000004,"d":"2,824 $"},1239,1486,1419,{"v":2478,"d":"2,478 $"},{"v":2838,"d":"2,838 $"}]
[80,"Somme","Nord-Pas-de-Calais-Picardie","Yaourt",{"v":1095,"d":"1,095 $"},{"v":1314,"d":"1,314 $"},{"v":2469,"d":"2,469 $"},730,876,1646,{"v":1095,"d":"1,095 $"},{"v":2469,"d":"2,469 $"}]
[81,"Tarn","Languedoc-Roussillon-Midi-Pyrénées","Lait",{"v":6357,"d":"6,357 $"},{"v":7626,"d":"7,626 $"},{"v":7080,"d":"7,080 $"},2119,2542,2360,{"v":7416.5,"d":"7,417 $"},{"v":8260,"d":"8,260 $"}]
[81,"Tarn","Languedoc-Roussillon-Midi-Pyrénées","Yaourt",{"v":4203,"d":"4,203 $"},{"v":5043,"d":"5,043 $"},{"v":3091.5,"d":"3,092 $"},2802,3362,2061,{"v":4203,"d":"4,203 $"},{"v":3091.5,"d":"3,092 $"}]
[81,"Tarn","Languedoc-Roussillon-Midi-Pyrénées","Fromage",{"v":3533.2000000000003,"d":"3,533 $"},{"v":4239.400000000001,"d":"4,239 $"},{"v":3262.6000000000004,"d":"3,263 $"},1606,1927,1483,{"v":3693.7999999999997,"d":"3,694 $"},{"v":3410.8999999999996,"d":"3,411 $"}]
[81,"Tarn","Languedoc-Roussillon-Midi-Pyrénées","Sucre",{"v":2282.5300000000007,"d":"2,283 $"},{"v":2738.2400000000007,"d":"2,738 $"},{"v":3058.63,"d":"3,059 $"},1147,1376,1537,{"v":2294,"d":"2,294 $"},{"v":3074,"d":"3,074 $"}]
[82,"Tarn-et-Garonne","Languedoc-Roussillon-Midi-Pyrénées","Lait",{"v":3591,"d":"3,591 $"},{"v":4308,"d":"4,308 $"},{"v":2826,"d":"2,826 $"},1197,1436,942,{"v":4189.5,"d":"4,190 $"},{"v":3297,"d":"3,297 $"}]
[82,"Tarn-et-Garonne","Languedoc-Roussillon-Midi-Pyrénées","Fromage",{"v":8014.6,"d":"8,015 $"},{"v":9616.2,"d":"9,616 $"},{"v":4345,"d":"4,345 $"},3643,4371,1975,{"v":8378.9,"d":"8,379 $"},{"v":4542.5,"d":"4,543 $"}]
[82,"Tarn-et-Garonne","Languedoc-Roussillon-Midi-Pyrénées","Sucre",{"v":3174.05,"d":"3,174 $"},{"v":3808.8600000000006,"d":"3,809 $"},{"v":2276.5600000000004,"d":"2,277 $"},1595,1914,1144,{"v":3190,"d":"3,190 $"},{"v":2288,"d":"2,288 $"}]
[82,"Tarn-et-Garonne","Languedoc-Roussillon-Midi-Pyrénées","Yaourt",{"v":3817.5,"d":"3,818 $"},{"v":4581,"d":"4,581 $"},{"v":2892,"d":"2,892 $"},2545,3054,1928,{"v":3817.5,"d":"3,818 $"},{"v":2892,"d":"2,892 $"}]
[82,"Tarn-et-Garonne","Languedoc-Roussillon-Midi-Pyrénées","Riz",{"v":3966,"d":"3,966 $"},{"v":4758,"d":"4,758 $"},{"v":3846,"d":"3,846 $"},1322,1586,1282,{"v":3966,"d":"3,966 $"},{"v":3846,"d":"3,846 $"}]
[90,"Territoire de Belfort","Bourgogne-Franche-Comté","Yaourt",{"v":2791.5,"d":"2,792 $"},{"v":3349.5,"d":"3,350 $"},{"v":1249.5,"d":"1,250 $"},1861,2233,833,{"v":2791.5,"d":"2,792 $"},{"v":1249.5,"d":"1,250 $"}]
[90,"Territoire de Belfort","Bourgogne-Franche-Comté","Sucre",{"v":181.09000000000003,"d":"181 $"},{"v":216.91000000000003,"d":"217 $"},{"v":1717.3700000000003,"d":"1,717 $"},91,109,863,{"v":182,"d":"182 $"},{"v":1726,"d":"1,726 $"}]
[90,"Territoire de Belfort","Bourgogne-Franche-Comté","Fromage",{"v":6228.200000000001,"d":"6,228 $"},{"v":7473.400000000001,"d":"7,473 $"},{"v":3165.8,"d":"3,166 $"},2831,3397,1439,{"v":6511.299999999999,"d":"6,511 $"},{"v":3309.7,"d":"3,310 $"}]
[90,"Territoire de Belfort","Bourgogne-Franche-Comté","Lait",{"v":1761,"d":"1,761 $"},{"v":2112,"d":"2,112 $"},{"v":4323,"d":"4,323 $"},587,704,1441,{"v":2054.5,"d":"2,055 $"},{"v":5043.5,"d":"5,044 $"}]
[90,"Territoire de Belfort","Bourgogne-Franche-Comté","Riz",{"v":5556,"d":"5,556 $"},{"v":6666,"d":"6,666 $"},{"v":4491,"d":"4,491 $"},1852,2222,1497,{"v":5556,"d":"5,556 $"},{"v":4491,"d":"4,491 $"}]
[94,"Val-de-Marne","Île-de-France","Fromage",{"v":1513.6000000000001,"d":"1,514 $"},{"v":1815.0000000000002,"d":"1,815 $"},{"v":4004,"d":"4,004 $"},688,825,1820,{"v":1582.3999999999999,"d":"1,582 $"},{"v":4186,"d":"4,186 $"}]
[94,"Val-de-Marne","Île-de-France","Lait",{"v":804,"d":"804 $"},{"v":963,"d":"963 $"},{"v":6054,"d":"6,054 $"},268,321,2018,{"v":938,"d":"938 $"},{"v":7063,"d":"7,063 $"}]
[94,"Val-de-Marne","Île-de-France","Riz",{"v":5667,"d":"5,667 $"},{"v":6798,"d":"6,798 $"},{"v":4791,"d":"4,791 $"},1889,2266,1597,{"v":5667,"d":"5,667 $"},{"v":4791,"d":"4,791 $"}]
[94,"Val-de-Marne","Île-de-France","Sucre",{"v":1637.77,"d":"1,638 $"},{"v":1964.13,"d":"1,964 $"},{"v":4364.07,"d":"4,364 $"},823,987,2193,{"v":1646,"d":"1,646 $"},{"v":4386,"d":"4,386 $"}]
[95,"Val-d'Oise","Île-de-France","Lait",{"$f":"H387*VLOOKUP($D387,$Q$2:$S$6,3,0)-K387","v":{"v":2190,"d":"2,190 $"}},{"$f":"I387*VLOOKUP($D387,$Q$2:$S$6,3,0)-I387*VLOOKUP($D387,$Q$2:$S$6,2,0)","v":{"v":2628,"d":"2,628 $"}},{"$f":"J387*VLOOKUP($D387,$Q$2:$S$6,3,0)-L387","v":{"v":7956,"d":"7,956 $"}},730,{"$f":"INT(H387*1.2)","v":876},2652,{"$f":"H387*VLOOKUP($D387,$Q$2:$S$6,2,0)","v":{"v":2555,"d":"2,555 $"}},{"$f":"J387*VLOOKUP($D387,$Q$2:$S$6,2,0)","v":{"v":9282,"d":"9,282 $"}}]
[95,"Val-d'Oise","Île-de-France","Riz",{"v":6735,"d":"6,735 $"},{"v":8082,"d":"8,082 $"},{"v":4632,"d":"4,632 $"},2245,2694,1544,{"v":6735,"d":"6,735 $"},{"v":4632,"d":"4,632 $"}]
[95,"Val-d'Oise","Île-de-France","Yaourt",{"v":3469.5,"d":"3,470 $"},{"v":4162.5,"d":"4,163 $"},{"v":2262,"d":"2,262 $"},2313,2775,1508,{"v":3469.5,"d":"3,470 $"},{"v":2262,"d":"2,262 $"}]
[95,"Val-d'Oise","Île-de-France","Sucre",{"v":628.8400000000001,"d":"629 $"},{"v":754.21,"d":"754 $"},{"v":2113.38,"d":"2,113 $"},316,379,1062,{"v":632,"d":"632 $"},{"v":2124,"d":"2,124 $"}]
[83,"Var","Provence-Alpes-Côte d'Azur","Fromage",{"v":2444.2000000000003,"d":"2,444 $"},{"v":2932.6000000000004,"d":"2,933 $"},{"v":5563.8,"d":"5,564 $"},1111,1333,2529,{"v":2555.2999999999997,"d":"2,555 $"},{"v":5816.7,"d":"5,817 $"}]
[83,"Var","Provence-Alpes-Côte d'Azur","Lait",{"v":4182,"d":"4,182 $"},{"v":5016,"d":"5,016 $"},{"v":4749,"d":"4,749 $"},1394,1672,1583,{"v":4879,"d":"4,879 $"},{"v":5540.5,"d":"5,541 $"}]
[83,"Var","Provence-Alpes-Côte d'Azur","Yaourt",{"v":3106.5,"d":"3,107 $"},{"v":3727.5,"d":"3,728 $"},{"v":3441,"d":"3,441 $"},2071,2485,2294,{"v":3106.5,"d":"3,107 $"},{"v":3441,"d":"3,441 $"}]
[84,"Vaucluse","Provence-Alpes-Côte d'Azur","Sucre",{"v":1904.4300000000003,"d":"1,904 $"},{"v":2284.5200000000004,"d":"2,285 $"},{"v":5251.610000000001,"d":"5,252 $"},957,1148,2639,{"v":1914,"d":"1,914 $"},{"v":5278,"d":"5,278 $"}]
[84,"Vaucluse","Provence-Alpes-Côte d'Azur","Fromage",{"v":7807.8,"d":"7,808 $"},{"v":9367.6,"d":"9,368 $"},{"v":4468.200000000001,"d":"4,468 $"},3549,4258,2031,{"v":8162.7,"d":"8,163 $"},{"v":4671.299999999999,"d":"4,671 $"}]
[84,"Vaucluse","Provence-Alpes-Côte d'Azur","Yaourt",{"v":330,"d":"330 $"},{"v":396,"d":"396 $"},{"v":3208.5,"d":"3,209 $"},220,264,2139,{"v":330,"d":"330 $"},{"v":3208.5,"d":"3,209 $"}]
[84,"Vaucluse","Provence-Alpes-Côte d'Azur","Lait",{"v":2235,"d":"2,235 $"},{"v":2682,"d":"2,682 $"},{"v":8067,"d":"8,067 $"},745,894,2689,{"v":2607.5,"d":"2,608 $"},{"v":9411.5,"d":"9,412 $"}]
[84,"Vaucluse","Provence-Alpes-Côte d'Azur","Riz",{"v":2544,"d":"2,544 $"},{"v":3051,"d":"3,051 $"},{"v":4467,"d":"4,467 $"},848,1017,1489,{"v":2544,"d":"2,544 $"},{"v":4467,"d":"4,467 $"}]
[85,"Vendée","Pays de la Loire","Lait",{"v":8031,"d":"8,031 $"},{"v":9636,"d":"9,636 $"},{"v":2442,"d":"2,442 $"},2677,3212,814,{"v":9369.5,"d":"9,370 $"},{"v":2849,"d":"2,849 $"}]
[85,"Vendée","Pays de la Loire","Sucre",{"v":3408.870000000001,"d":"3,409 $"},{"v":4089.4500000000007,"d":"4,089 $"},{"v":2867.59,"d":"2,868 $"},1713,2055,1441,{"v":3426,"d":"3,426 $"},{"v":2882,"d":"2,882 $"}]
[85,"Vendée","Pays de la Loire","Fromage",{"v":5046.8,"d":"5,047 $"},{"v":6054.400000000001,"d":"6,054 $"},{"v":2180.2000000000003,"d":"2,180 $"},2294,2752,991,{"v":5276.2,"d":"5,276 $"},{"v":2279.2999999999997,"d":"2,279 $"}]
[85,"Vendée","Pays de la Loire","Riz",{"v":9519,"d":"9,519 $"},{"v":11421,"d":"11,421 $"},{"v":6243,"d":"6,243 $"},3173,3807,2081,{"v":9519,"d":"9,519 $"},{"v":6243,"d":"6,243 $"}]
[85,"Vendée","Pays de la Loire","Yaourt",{"v":1731,"d":"1,731 $"},{"v":2076,"d":"2,076 $"},{"v":1396.5,"d":"1,397 $"},1154,1384,931,{"v":1731,"d":"1,731 $"},{"v":1396.5,"d":"1,397 $"}]
[86,"Vienne","Aquitaine-Limousin-Poitou-Charentes","Yaourt",{"v":3276,"d":"3,276 $"},{"v":3930,"d":"3,930 $"},{"v":1272,"d":"1,272 $"},2184,2620,848,{"v":3276,"d":"3,276 $"},{"v":1272,"d":"1,272 $"}]
[86,"Vienne","Aquitaine-Limousin-Poitou-Charentes","Lait",{"v":2373,"d":"2,373 $"},{"v":2847,"d":"2,847 $"},{"v":7707,"d":"7,707 $"},791,949,2569,{"v":2768.5,"d":"2,769 $"},{"v":8991.5,"d":"8,992 $"}]
[86,"Vienne","Aquitaine-Limousin-Poitou-Charentes","Sucre",{"v":2722.3200000000006,"d":"2,722 $"},{"v":3265.59,"d":"3,266 $"},{"v":2720.33,"d":"2,720 $"},1368,1641,1367,{"v":2736,"d":"2,736 $"},{"v":2734,"d":"2,734 $"}]
[86,"Vienne","Aquitaine-Limousin-Poitou-Charentes","Riz",{"v":5844,"d":"5,844 $"},{"v":7011,"d":"7,011 $"},{"v":5982,"d":"5,982 $"},1948,2337,1994,{"v":5844,"d":"5,844 $"},{"v":5982,"d":"5,982 $"}]
[86,"Vienne","Aquitaine-Limousin-Poitou-Charentes","Fromage",{"v":1372.8000000000002,"d":"1,373 $"},{"v":1645.6000000000001,"d":"1,646 $"},{"v":5786.000000000001,"d":"5,786 $"},624,748,2630,{"v":1435.1999999999998,"d":"1,435 $"},{"v":6048.999999999999,"d":"6,049 $"}]
[88,"Vosges","Alsace-Champagne-Ardenne-Lorraine","Yaourt",{"v":3159,"d":"3,159 $"},{"v":3790.5,"d":"3,791 $"},{"v":1614,"d":"1,614 $"},2106,2527,1076,{"v":3159,"d":"3,159 $"},{"v":1614,"d":"1,614 $"}]
[88,"Vosges","Alsace-Champagne-Ardenne-Lorraine","Lait",{"v":3372,"d":"3,372 $"},{"v":4044,"d":"4,044 $"},{"v":6834,"d":"6,834 $"},1124,1348,2278,{"v":3934,"d":"3,934 $"},{"v":7973,"d":"7,973 $"}]
[88,"Vosges","Alsace-Champagne-Ardenne-Lorraine","Riz",{"v":4446,"d":"4,446 $"},{"v":5334,"d":"5,334 $"},{"v":6258,"d":"6,258 $"},1482,1778,2086,{"v":4446,"d":"4,446 $"},{"v":6258,"d":"6,258 $"}]
[89,"Yonne","Bourgogne-Franche-Comté","Lait",{"v":4125,"d":"4,125 $"},{"v":4950,"d":"4,950 $"},{"v":6672,"d":"6,672 $"},1375,1650,2224,{"v":4812.5,"d":"4,813 $"},{"v":7784,"d":"7,784 $"}]
[89,"Yonne","Bourgogne-Franche-Comté","Sucre",{"v":648.74,"d":"649 $"},{"v":778.0900000000001,"d":"778 $"},{"v":3016.84,"d":"3,017 $"},326,391,1516,{"v":652,"d":"652 $"},{"v":3032,"d":"3,032 $"}]
[89,"Yonne","Bourgogne-Franche-Comté","Fromage",{"v":2208.8,"d":"2,209 $"},{"v":2648.8,"d":"2,649 $"},{"v":2409,"d":"2,409 $"},1004,1204,1095,{"v":2309.2,"d":"2,309 $"},{"v":2518.5,"d":"2,519 $"}]
[89,"Yonne","Bourgogne-Franche-Comté","Yaourt",{"v":904.5,"d":"905 $"},{"v":1084.5,"d":"1,085 $"},{"v":3255,"d":"3,255 $"},603,723,2170,{"v":904.5,"d":"905 $"},{"v":3255,"d":"3,255 $"}]
[78,"Yvelines","Île-de-France","Yaourt",{"v":382.5,"d":"383 $"},{"v":459,"d":"459 $"},{"v":2158.5,"d":"2,159 $"},255,306,1439,{"v":382.5,"d":"383 $"},{"v":2158.5,"d":"2,159 $"}]
[78,"Yvelines","Île-de-France","Fromage",{"v":1216.6000000000001,"d":"1,217 $"},{"v":1458.6000000000001,"d":"1,459 $"},{"v":3256.0000000000005,"d":"3,256 $"},553,663,1480,{"v":1271.8999999999999,"d":"1,272 $"},{"v":3403.9999999999995,"d":"3,404 $"}]
[78,"Yvelines","Île-de-France","Lait",{"v":8643,"d":"8,643 $"},{"v":10371,"d":"10,371 $"},{"v":5406,"d":"5,406 $"},2881,3457,1802,{"v":10083.5,"d":"10,084 $"},{"v":6307,"d":"6,307 $"}]
[78,"Yvelines","Île-de-France","Riz",{"v":7230,"d":"7,230 $"},{"v":8676,"d":"8,676 $"},{"v":4824,"d":"4,824 $"},2410,2892,1608,{"v":7230,"d":"7,230 $"},{"v":4824,"d":"4,824 $"}]
[78,"Yvelines","Île-de-France","Sucre",{"v":4206.860000000001,"d":"4,207 $"},{"v":5046.640000000001,"d":"5,047 $"},{"v":3010.87,"d":"3,011 $"},2114,2536,1513,{"v":4228,"d":"4,228 $"},{"v":3026,"d":"3,026 $"}]

{"sheet":"nomRegions","index":7,"n_rows":66,"n_cols":20,"rows_kept":66,"hidden":true,"merged":[[17,10,17,13]]}
["numReg","nomReg","Cibles","Résultat",null,null,"numReg","pourcReg",{"$nulls":8},"nomDept","nomProd",2014,2015]
["44R","Alsace-Champagne-Ardenne-Lorraine",{"$f":"SUMIF(donnees!$C$2:$C$420,$B2,donnees!$F$2:$F$420)","v":{"v":223138.21999999997,"d":"223,138 $"}},{"$f":"SUMIF(donnees!$C$2:$C$420,$B2,donnees!$G$2:$G$420)","v":{"v":188311.25000000003,"d":"188,311 $"}},{"$f":"VLOOKUP(D2/C2,classeReg,4,1)","v":"classe1"},null,"44P",{"$f":"D2/C2","v":{"v":0.84392198700877,"d":"84%"}},"Alsace-Champagne-Ardenne-Lorraine","F","76R",{"$nulls":4},{"$f":"Q2&ROW()","v":"Alsace-Champagne-Ardenne-Lorraine2"},"Alsace-Champagne-Ardenne-Lorraine","Fromage",{"$f":"SUMIFS(donnees!$E$2:$E$420,donnees!$D$2:$D$420,nomRegions!$R2,donnees!$C$2:$C$420,nomRegions!$Q2)","v":33228.80000000001},{"$f":"SUMIFS(donnees!$G$2:$G$420,donnees!$D$2:$D$420,nomRegions!$R2,donnees!$C$2:$C$420,nomRegions!$Q2)","v":32936.2}]
["75R","Aquitaine-Limousin-Poitou-Charentes",{"$f":"SUMIF(donnees!$C$2:$C$420,$B3,donnees!$F$2:$F$420)","v":{"v":266339.02,"d":"266,339 $"}},{"$f":"SUMIF(donnees!$C$2:$C$420,$B3,donnees!$G$2:$G$420)","v":{"v":217147.10999999996,"d":"217,147 $"}},{"$f":"VLOOKUP(D3/C3,classeReg,4,1)","v":"classe1"},null,"75P",{"$f":"D3/C3","v":{"v":0.8153034054116439,"d":"82%"}},{"$nulls":7},{"$f":"Q3&ROW()","v":"Alsace-Champagne-Ardenne-Lorraine3"},"Alsace-Champagne-Ardenne-Lorraine","Lait",{"$f":"SUMIFS(donnees!$E$2:$E$420,donnees!$D$2:$D$420,nomRegions!$R3,donnees!$C$2:$C$420,nomRegions!$Q3)","v":49755},{"$f":"SUMIFS(donnees!$G$2:$G$420,donnees!$D$2:$D$420,nomRegions!$R3,donnees!$C$2:$C$420,nomRegions!$Q3)","v":44895}]
["84R","Auvergne-Rhône-Alpes",{"$f":"SUMIF(donnees!$C$2:$C$420,$B4,donnees!$F$2:$F$420)","v":{"v":239036.97999999998,"d":"239,037 $"}},{"$f":"SUMIF(donnees!$C$2:$C$420,$B4,donnees!$G$2:$G$420)","v":{"v":236882.44,"d":"236,882 $"}},"classe2",null,"84P",{"v":0.9909865829128197,"d":"99%"},{"$nulls":7},"Alsace-Champagne-Ardenne-Lorraine4","Alsace-Champagne-Ardenne-Lorraine","Riz",{"$f":"SUMIFS(donnees!$E$2:$E$420,donnees!$D$2:$D$420,nomRegions!$R4,donnees!$C$2:$C$420,nomRegions!$Q4)","v":58566},{"$f":"SUMIFS(donnees!$G$2:$G$420,donnees!$D$2:$D$420,nomRegions!$R4,donnees!$C$2:$C$420,nomRegions!$Q4)","v":61416}]
["27R","Bourgogne-Franche-Comté",{"$f":"SUMIF(donnees!$C$2:$C$420,$B5,donnees!$F$2:$F$420)","v":{"v":146495.05000000002,"d":"146,495 $"}},{"$f":"SUMIF(donnees!$C$2:$C$420,$B5,donnees!$G$2:$G$420)","v":{"v":118605.51999999999,"d":"118,606 $"}},"classe1",null,"27P",{"v":0.8096213489807333,"d":"81%"},null,{"$f":"IFERROR(VLOOKUP(idRegion,$A$2:$B$14,2,0),\"\")","v":"Languedoc-Roussillon-Midi-Pyrénées"},{"$nulls":5},"Alsace-Champagne-Ardenne-Lorraine5","Alsace-Champagne-Ardenne-Lorraine","Sucre",{"$f":"SUMIFS(donnees!$E$2:$E$420,donnees!$D$2:$D$420,nomRegions!$R5,donnees!$C$2:$C$420,nomRegions!$Q5)","v":27364.490000000005},{"$f":"SUMIFS(donnees!$G$2:$G$420,donnees!$D$2:$D$420,nomRegions!$R5,donnees!$C$2:$C$420,nomRegions!$Q5)","v":32526.550000000003}]
["53R","Bretagne",{"$f":"SUMIF(donnees!$C$2:$C$420,$B6,donnees!$F$2:$F$420)","v":{"v":61000.54000000001,"d":"61,001 $"}},{"$f":"SUMIF(donnees!$C$2:$C$420,$B6,donnees!$G$2:$G$420)","v":{"v":65875.35,"d":"65,875 $"}},"classe3",null,"53P",{"v":1.0799142105955126,"d":"108%"},{"$nulls":7},"Alsace-Champagne-Ardenne-Lorraine6","Alsace-Champagne-Ardenne-Lorraine","Yaourt",{"$f":"SUMIFS(donnees!$E$2:$E$420,donnees!$D$2:$D$420,nomRegions!$R6,donnees!$C$2:$C$420,nomRegions!$Q6)","v":17068.5},{"$f":"SUMIFS(donnees!$G$2:$G$420,donnees!$D$2:$D$420,nomRegions!$R6,donnees!$C$2:$C$420,nomRegions!$Q6)","v":16537.5}]
["24R","Centre-Val de Loire",{"$f":"SUMIF(donnees!$C$2:$C$420,$B7,donnees!$F$2:$F$420)","v":{"v":122432.40000000002,"d":"122,432 $"}},{"$f":"SUMIF(donnees!$C$2:$C$420,$B7,donnees!$G$2:$G$420)","v":{"v":100413.26000000001,"d":"100,413 $"}},"classe1",null,"24P",{"v":0.8201526720051228,"d":"82%"},null,null,"nomDept","nomProd",2014,2015,null,"Aquitaine-Limousin-Poitou-Charentes7","Aquitaine-Limousin-Poitou-Charentes","Fromage",{"$f":"SUMIFS(donnees!$E$2:$E$420,donnees!$D$2:$D$420,nomRegions!$R7,donnees!$C$2:$C$420,nomRegions!$Q7)","v":32348.800000000007},{"$f":"SUMIFS(donnees!$G$2:$G$420,donnees!$D$2:$D$420,nomRegions!$R7,donnees!$C$2:$C$420,nomRegions!$Q7)","v":43551.2}]
["94R","Corse",{"$f":"SUMIF(donnees!$C$2:$C$420,$B8,donnees!$F$2:$F$420)","v":{"v":41257.83,"d":"41,258 $"}},{"$f":"SUMIF(donnees!$C$2:$C$420,$B8,donnees!$G$2:$G$420)","v":{"v":24763.57,"d":"24,764 $"}},"classe0",null,"94P",{"v":0.6002150379697623,"d":"60%"},null,null,{"$f":"IFERROR($J$5& MATCH($J$5,$Q:$Q,0),\"\")","v":"Languedoc-Roussillon-Midi-Pyrénées42"},{"$f":"IFERROR(VLOOKUP($K8,detailsRegion,COLUMN(S1)-COLUMN($P$1),0),\"\")","v":"Fromage"},{"v":48846.600000000006,"d":"48,847 €"},{"v":46050.399999999994,"d":"46,050 €"},null,"Aquitaine-Limousin-Poitou-Charentes8","Aquitaine-Limousin-Poitou-Charentes","Lait",{"$f":"SUMIFS(donnees!$E$2:$E$420,donnees!$D$2:$D$420,nomRegions!$R8,donnees!$C$2:$C$420,nomRegions!$Q8)","v":69819},{"$f":"SUMIFS(donnees!$G$2:$G$420,donnees!$D$2:$D$420,nomRegions!$R8,donnees!$C$2:$C$420,nomRegions!$Q8)","v":48900}]
["11R","Île-de-France",{"$f":"SUMIF(donnees!$C$2:$C$420,$B9,donnees!$F$2:$F$420)","v":{"v":151705.29000000004,"d":"151,705 $"}},{"$f":"SUMIF(donnees!$C$2:$C$420,$B9,donnees!$G$2:$G$420)","v":{"v":124593.42000000001,"d":"124,593 $"}},"classe1",null,"11P",{"v":0.8212859287899583,"d":"82%"},null,null,{"$f":"IFERROR($J$5& MATCH($J$5,$Q:$Q,0)+ROW(O1),\"\")","v":"Languedoc-Roussillon-Midi-Pyrénées43"},"Lait",{"v":52122,"d":"52,122 €"},{"v":62547,"d":"62,547 €"},null,"Aquitaine-Limousin-Poitou-Charentes9","Aquitaine-Limousin-Poitou-Charentes","Riz",{"$f":"SUMIFS(donnees!$E$2:$E$420,donnees!$D$2:$D$420,nomRegions!$R9,donnees!$C$2:$C$420,nomRegions!$Q9)","v":56649},{"$f":"SUMIFS(donnees!$G$2:$G$420,donnees!$D$2:$D$420,nomRegions!$R9,donnees!$C$2:$C$420,nomRegions!$Q9)","v":48210}]
["76R","Languedoc-Roussillon-Midi-Pyrénées",{"$f":"SUMIF(donnees!$C$2:$C$420,$B10,donnees!$F$2:$F$420)","v":{"v":270783.95999999996,"d":"270,784 $"}},{"$f":"SUMIF(donnees!$C$2:$C$420,$B10,donnees!$G$2:$G$420)","v":{"v":243337.73,"d":"243,338 $"}},"classe2",null,"76P",{"v":0.8986415960531785,"d":"90%"},null,null,{"$f":"IFERROR($J$5& MATCH($J$5,$Q:$Q,0)+ROW(O2),\"\")","v":"Languedoc-Roussillon-Midi-Pyrénées44"},"Riz",{"v":55569,"d":"55,569 €"},{"v":58782,"d":"58,782 €"},null,"Aquitaine-Limousin-Poitou-Charentes10","Aquitaine-Limousin-Poitou-Charentes","Sucre",{"$f":"SUMIFS(donnees!$E$2:$E$420,donnees!$D$2:$D$420,nomRegions!$R10,donnees!$C$2:$C$420,nomRegions!$Q10)","v":36570.23},{"$f":"SUMIFS(donnees!$G$2:$G$420,donnees!$D$2:$D$420,nomRegions!$R10,donnees!$C$2:$C$420,nomRegions!$Q10)","v":44096.41000000001}]
["32R","Nord-Pas-de-Calais-Picardie",{"$f":"SUMIF(donnees!$C$2:$C$420,$B11,donnees!$F$2:$F$420)","v":{"v":79599.09,"d":"79,599 $"}},{"$f":"SUMIF(donnees!$C$2:$C$420,$B11,donnees!$G$2:$G$420)","v":{"v":85567.16,"d":"85,567 $"}},"classe3",null,"32P",{"v":1.0749766109135168,"d":"107%"},null,null,"Languedoc-Roussillon-Midi-Pyrénées45","Sucre",{"v":40824.850000000006,"d":"40,825 €"},{"v":41923.329999999994,"d":"41,923 €"},null,"Aquitaine-Limousin-Poitou-Charentes11","Aquitaine-Limousin-Poitou-Charentes","Yaourt",{"$f":"SUMIFS(donnees!$E$2:$E$420,donnees!$D$2:$D$420,nomRegions!$R11,donnees!$C$2:$C$420,nomRegions!$Q11)","v":26608.5},{"$f":"SUMIFS(donnees!$G$2:$G$420,donnees!$D$2:$D$420,nomRegions!$R11,donnees!$C$2:$C$420,nomRegions!$Q11)","v":32389.5}]
["28R","Normandie",{"$f":"SUMIF(donnees!$C$2:$C$420,$B12,donnees!$F$2:$F$420)","v":{"v":112642.37,"d":"112,642 $"}},{"$f":"SUMIF(donnees!$C$2:$C$420,$B12,donnees!$G$2:$G$420)","v":{"v":84073.48000000001,"d":"84,073 $"}},"classe0",null,"28P",{"v":0.7463752760173638,"d":"75%"},null,null,"Languedoc-Roussillon-Midi-Pyrénées46","Yaourt",{"v":28329,"d":"28,329 €"},{"v":34035,"d":"34,035 €"},null,"Auvergne-Rhône-Alpes12","Auvergne-Rhône-Alpes","Fromage",{"$f":"SUMIFS(donnees!$E$2:$E$420,donnees!$D$2:$D$420,nomRegions!$R12,donnees!$C$2:$C$420,nomRegions!$Q12)","v":43296.00000000001},{"$f":"SUMIFS(donnees!$G$2:$G$420,donnees!$D$2:$D$420,nomRegions!$R12,donnees!$C$2:$C$420,nomRegions!$Q12)","v":47942.4}]
["52R","Pays de la Loire",{"$f":"SUMIF(donnees!$C$2:$C$420,$B13,donnees!$F$2:$F$420)","v":{"v":114019.40999999997,"d":"114,019 $"}},{"$f":"SUMIF(donnees!$C$2:$C$420,$B13,donnees!$G$2:$G$420)","v":{"v":98214.63999999998,"d":"98,215 $"}},"classe2",null,"52P",{"v":0.8613852676487276,"d":"86%"},{"$nulls":3},"total",{"$f":"SUM(M8:M12)","v":{"v":225691.45,"d":"225,691 €"}},{"$f":"SUM(N8:N12)","v":{"v":243337.72999999998,"d":"243,338 €"}},null,"Auvergne-Rhône-Alpes13","Auvergne-Rhône-Alpes","Lait",{"$f":"SUMIFS(donnees!$E$2:$E$420,donnees!$D$2:$D$420,nomRegions!$R13,donnees!$C$2:$C$420,nomRegions!$Q13)","v":48138},{"$f":"SUMIFS(donnees!$G$2:$G$420,donnees!$D$2:$D$420,nomRegions!$R13,donnees!$C$2:$C$420,nomRegions!$Q13)","v":58830}]
["93R","Provence-Alpes-Côte d'Azur",{"$f":"SUMIF(donnees!$C$2:$C$420,$B14,donnees!$F$2:$F$420)","v":{"v":124639.66000000002,"d":"124,640 $"}},{"$f":"SUMIF(donnees!$C$2:$C$420,$B14,donnees!$G$2:$G$420)","v":{"v":100558.86,"d":"100,559 $"}},"classe1",null,"93P",{"v":0.806796648835531,"d":"81%"},{"$nulls":7},"Auvergne-Rhône-Alpes14","Auvergne-Rhône-Alpes","Riz",{"$f":"SUMIFS(donnees!$E$2:$E$420,donnees!$D$2:$D$420,nomRegions!$R14,donnees!$C$2:$C$420,nomRegions!$Q14)","v":54936},{"$f":"SUMIFS(donnees!$G$2:$G$420,donnees!$D$2:$D$420,nomRegions!$R14,donnees!$C$2:$C$420,nomRegions!$Q14)","v":68034}]
[null,"Total",{"$f":"SUM(C2:C14)","v":{"v":1953089.8199999998,"d":"1,953,090 $"}},{"$f":"SUM(D2:D14)","v":{"v":1688343.7899999998,"d":"1,688,344 $"}},{"$nulls":11},"Auvergne-Rhône-Alpes15","Auvergne-Rhône-Alpes","Sucre",{"$f":"SUMIFS(donnees!$E$2:$E$420,donnees!$D$2:$D$420,nomRegions!$R15,donnees!$C$2:$C$420,nomRegions!$Q15)","v":37722.44},{"$f":"SUMIFS(donnees!$G$2:$G$420,donnees!$D$2:$D$420,nomRegions!$R15,donnees!$C$2:$C$420,nomRegions!$Q15)","v":34717.54}]
[{"$nulls":15},"Auvergne-Rhône-Alpes16","Auvergne-Rhône-Alpes","Yaourt",{"$f":"SUMIFS(donnees!$E$2:$E$420,donnees!$D$2:$D$420,nomRegions!$R16,donnees!$C$2:$C$420,nomRegions!$Q16)","v":15153},{"$f":"SUMIFS(donnees!$G$2:$G$420,donnees!$D$2:$D$420,nomRegions!$R16,donnees!$C$2:$C$420,nomRegions!$Q16)","v":27358.5}]
[{"$f":"D2/C2","v":0.84392198700877},{"$f":"B2","v":"Alsace-Champagne-Ardenne-Lorraine"},{"$nulls":13},"Bourgogne-Franche-Comté17","Bourgogne-Franche-Comté","Fromage",{"$f":"SUMIFS(donnees!$E$2:$E$420,donnees!$D$2:$D$420,nomRegions!$R17,donnees!$C$2:$C$420,nomRegions!$Q17)","v":18515.2},{"$f":"SUMIFS(donnees!$G$2:$G$420,donnees!$D$2:$D$420,nomRegions!$R17,donnees!$C$2:$C$420,nomRegions!$Q17)","v":14416.600000000002}]
[{"$f":"D3/C3","v":0.8153034054116439},{"$f":"B3","v":"Aquitaine-Limousin-Poitou-Charentes"},{"$nulls":8},"grapheC et grapheB",{"$nulls":4},"Bourgogne-Franche-Comté18","Bourgogne-Franche-Comté","Lait",{"$f":"SUMIFS(donnees!$E$2:$E$420,donnees!$D$2:$D$420,nomRegions!$R18,donnees!$C$2:$C$420,nomRegions!$Q18)","v":32298},{"$f":"SUMIFS(donnees!$G$2:$G$420,donnees!$D$2:$D$420,nomRegions!$R18,donnees!$C$2:$C$420,nomRegions!$Q18)","v":34347}]
[0.9909865829128197,"Auvergne-Rhône-Alpes",{"$nulls":7},{"$f":"IF(typeD=\"R\",actRegion,IF(typeD=\"F\",\"France métropolitaine\",deptNum))","v":"France métropolitaine"},"nomProd",2014,2015,"cible",null,"Bourgogne-Franche-Comté19","Bourgogne-Franche-Comté","Riz",{"$f":"SUMIFS(donnees!$E$2:$E$420,donnees!$D$2:$D$420,nomRegions!$R19,donnees!$C$2:$C$420,nomRegions!$Q19)","v":33342},{"$f":"SUMIFS(donnees!$G$2:$G$420,donnees!$D$2:$D$420,nomRegions!$R19,donnees!$C$2:$C$420,nomRegions!$Q19)","v":28299}]
[0.8096213489807333,"Bourgogne-Franche-Comté",{"$nulls":8},{"$f":"IF(typeD=\"R\",L8,IF(typeD=\"F\",K35,nomDept!L8))","v":"Fromage"},{"$f":"IF(typeD=\"R\",M8,IF(typeD=\"F\",L35,nomDept!M8))","v":300434.19999999984},{"$f":"IF(typeD=\"R\",N8,IF(typeD=\"F\",M35,nomDept!N8))","v":318894.60000000003},{"$f":"IF(typeD=\"R\",VLOOKUP(actRegion,$B$2:$C$14,2,0),IF(typeD=\"F\",$C$15,VLOOKUP(actDept,nomDept!$B$2:$C$97,2,0)))","v":{"v":1953089.8199999998,"d":"1,953,090 $"}},null,"Bourgogne-Franche-Comté20","Bourgogne-Franche-Comté","Sucre",{"$f":"SUMIFS(donnees!$E$2:$E$420,donnees!$D$2:$D$420,nomRegions!$R20,donnees!$C$2:$C$420,nomRegions!$Q20)","v":24190.440000000006},{"$f":"SUMIFS(donnees!$G$2:$G$420,donnees!$D$2:$D$420,nomRegions!$R20,donnees!$C$2:$C$420,nomRegions!$Q20)","v":25288.920000000002}]
[1.0799142105955126,"Bretagne",{"$nulls":7},{"$f":"IF(typeD=\"F\",\"France: résultats MCB 2015\",IF(typeD=\"D\",\"Résultats MCB 2015: \"&J19,\"Résultats MCB 2015: \"&actRegion))","v":"France: résultats MCB 2015"},{"$f":"IF(typeD=\"R\",L9,IF(typeD=\"F\",K36,nomDept!L9))","v":"Lait"},{"$f":"IF(typeD=\"R\",M9,IF(typeD=\"F\",L36,nomDept!M9))","v":401805},{"$f":"IF(typeD=\"R\",N9,IF(typeD=\"F\",M36,nomDept!N9))","v":419412},null,null,"Bourgogne-Franche-Comté21","Bourgogne-Franche-Comté","Yaourt",{"$f":"SUMIFS(donnees!$E$2:$E$420,donnees!$D$2:$D$420,nomRegions!$R21,donnees!$C$2:$C$420,nomRegions!$Q21)","v":13759.5},{"$f":"SUMIFS(donnees!$G$2:$G$420,donnees!$D$2:$D$420,nomRegions!$R21,donnees!$C$2:$C$420,nomRegions!$Q21)","v":16254}]
[0.8201526720051228,"Centre-Val de Loire",{"$nulls":8},{"$f":"IF(typeD=\"R\",L10,IF(typeD=\"F\",K37,nomDept!L10))","v":"Riz"},{"$f":"IF(typeD=\"R\",M10,IF(typeD=\"F\",L37,nomDept!M10))","v":459363},{"$f":"IF(typeD=\"R\",N10,IF(typeD=\"F\",M37,nomDept!N10))","v":435645},null,null,"Bretagne22","Bretagne","Fromage",{"$f":"SUMIFS(donnees!$E$2:$E$420,donnees!$D$2:$D$420,nomRegions!$R22,donnees!$C$2:$C$420,nomRegions!$Q22)","v":14091},{"$f":"SUMIFS(donnees!$G$2:$G$420,donnees!$D$2:$D$420,nomRegions!$R22,donnees!$C$2:$C$420,nomRegions!$Q22)","v":18326}]
[0.6002150379697623,"Corse",{"$nulls":8},{"$f":"IF(typeD=\"R\",L11,IF(typeD=\"F\",K38,nomDept!L11))","v":"Sucre"},{"$f":"IF(typeD=\"R\",M11,IF(typeD=\"F\",L38,nomDept!M11))","v":276365.23},{"$f":"IF(typeD=\"R\",N11,IF(typeD=\"F\",M38,nomDept!N11))","v":291696.19000000006},null,null,"Bretagne23","Bretagne","Lait",{"$f":"SUMIFS(donnees!$E$2:$E$420,donnees!$D$2:$D$420,nomRegions!$R23,donnees!$C$2:$C$420,nomRegions!$Q23)","v":8898},{"$f":"SUMIFS(donnees!$G$2:$G$420,donnees!$D$2:$D$420,nomRegions!$R23,donnees!$C$2:$C$420,nomRegions!$Q23)","v":11391}]
[0.8212859287899583,"Île-de-France",{"$nulls":8},{"$f":"IF(typeD=\"R\",L12,IF(typeD=\"F\",K39,nomDept!L12))","v":"Yaourt"},{"$f":"IF(typeD=\"R\",M12,IF(typeD=\"F\",L39,nomDept!M12))","v":190107},{"$f":"IF(typeD=\"R\",N12,IF(typeD=\"F\",M39,nomDept!N12))","v":222696},null,null,"Bretagne24","Bretagne","Riz",{"$f":"SUMIFS(donnees!$E$2:$E$420,donnees!$D$2:$D$420,nomRegions!$R24,donnees!$C$2:$C$420,nomRegions!$Q24)","v":9786},{"$f":"SUMIFS(donnees!$G$2:$G$420,donnees!$D$2:$D$420,nomRegions!$R24,donnees!$C$2:$C$420,nomRegions!$Q24)","v":10437}]
[0.8986415960531785,"Languedoc-Roussillon-Midi-Pyrénées",{"$nulls":8},{"$f":"IF(typeD=\"R\",L13,IF(typeD=\"F\",K40,nomDept!L13))","v":"total"},{"$f":"IF(typeD=\"R\",M13,IF(typeD=\"F\",L40,nomDept!M13))","v":{"v":1628074.4299999997,"d":"1,628,074 $"}},{"$f":"IF(typeD=\"R\",N13,IF(typeD=\"F\",M40,nomDept!N13))","v":{"v":1688343.79,"d":"1,688,344 $"}},null,null,"Bretagne25","Bretagne","Sucre",{"$f":"SUMIFS(donnees!$E$2:$E$420,donnees!$D$2:$D$420,nomRegions!$R25,donnees!$C$2:$C$420,nomRegions!$Q25)","v":9416.68},{"$f":"SUMIFS(donnees!$G$2:$G$420,donnees!$D$2:$D$420,nomRegions!$R25,donnees!$C$2:$C$420,nomRegions!$Q25)","v":17243.35}]
[1.0749766109135168,"Nord-Pas-de-Calais-Picardie",{"$nulls":13},"Bretagne26","Bretagne","Yaourt",{"$f":"SUMIFS(donnees!$E$2:$E$420,donnees!$D$2:$D$420,nomRegions!$R26,donnees!$C$2:$C$420,nomRegions!$Q26)","v":8658},{"$f":"SUMIFS(donnees!$G$2:$G$420,donnees!$D$2:$D$420,nomRegions!$R26,donnees!$C$2:$C$420,nomRegions!$Q26)","v":8478}]
[0.7463752760173638,"Normandie",{"$nulls":13},"Centre-Val de Loire27","Centre-Val de Loire","Fromage",{"$f":"SUMIFS(donnees!$E$2:$E$420,donnees!$D$2:$D$420,nomRegions!$R27,donnees!$C$2:$C$420,nomRegions!$Q27)","v":25335.2},{"$f":"SUMIFS(donnees!$G$2:$G$420,donnees!$D$2:$D$420,nomRegions!$R27,donnees!$C$2:$C$420,nomRegions!$Q27)","v":23522.4}]
[{"$f":"D13/C13","v":0.8613852676487276},"Pays de la Loire",{"$nulls":8},{"$f":"J19&\": répartition de la MCB par produit (%)\"","v":"France métropolitaine: répartition de la MCB par produit (%)"},{"$nulls":4},"Centre-Val de Loire28","Centre-Val de Loire","Lait",{"$f":"SUMIFS(donnees!$E$2:$E$420,donnees!$D$2:$D$420,nomRegions!$R28,donnees!$C$2:$C$420,nomRegions!$Q28)","v":7632},{"$f":"SUMIFS(donnees!$G$2:$G$420,donnees!$D$2:$D$420,nomRegions!$R28,donnees!$C$2:$C$420,nomRegions!$Q28)","v":21432}]
[0.806796648835531,"Provence-Alpes-Côte d'Azur",{"$nulls":8},{"$f":"J19&\": comparaison de la MCB\"","v":"France métropolitaine: comparaison de la MCB"},{"$nulls":4},"Centre-Val de Loire29","Centre-Val de Loire","Riz",{"$f":"SUMIFS(donnees!$E$2:$E$420,donnees!$D$2:$D$420,nomRegions!$R29,donnees!$C$2:$C$420,nomRegions!$Q29)","v":28656},{"$f":"SUMIFS(donnees!$G$2:$G$420,donnees!$D$2:$D$420,nomRegions!$R29,donnees!$C$2:$C$420,nomRegions!$Q29)","v":19983}]
[{"$nulls":15},"Centre-Val de Loire30","Centre-Val de Loire","Sucre",{"$f":"SUMIFS(donnees!$E$2:$E$420,donnees!$D$2:$D$420,nomRegions!$R30,donnees!$C$2:$C$420,nomRegions!$Q30)","v":27282.9},{"$f":"SUMIFS(donnees!$G$2:$G$420,donnees!$D$2:$D$420,nomRegions!$R30,donnees!$C$2:$C$420,nomRegions!$Q30)","v":22116.860000000004}]
[{"$nulls":15},"Centre-Val de Loire31","Centre-Val de Loire","Yaourt",{"$f":"SUMIFS(donnees!$E$2:$E$420,donnees!$D$2:$D$420,nomRegions!$R31,donnees!$C$2:$C$420,nomRegions!$Q31)","v":13140},{"$f":"SUMIFS(donnees!$G$2:$G$420,donnees!$D$2:$D$420,nomRegions!$R31,donnees!$C$2:$C$420,nomRegions!$Q31)","v":13359}]
[{"$nulls":15},"Corse32","Corse","Fromage",{"$f":"SUMIFS(donnees!$E$2:$E$420,donnees!$D$2:$D$420,nomRegions!$R32,donnees!$C$2:$C$420,nomRegions!$Q32)","v":8087.200000000001},{"$f":"SUMIFS(donnees!$G$2:$G$420,donnees!$D$2:$D$420,nomRegions!$R32,donnees!$C$2:$C$420,nomRegions!$Q32)","v":7977.200000000001}]
[{"$nulls":15},"Corse33","Corse","Lait",{"$f":"SUMIFS(donnees!$E$2:$E$420,donnees!$D$2:$D$420,nomRegions!$R33,donnees!$C$2:$C$420,nomRegions!$Q33)","v":1995},{"$f":"SUMIFS(donnees!$G$2:$G$420,donnees!$D$2:$D$420,nomRegions!$R33,donnees!$C$2:$C$420,nomRegions!$Q33)","v":3912}]
[{"$nulls":10},"nomPrdt",2014,2015,null,null,"Corse34","Corse","Riz",{"$f":"SUMIFS(donnees!$E$2:$E$420,donnees!$D$2:$D$420,nomRegions!$R34,donnees!$C$2:$C$420,nomRegions!$Q34)","v":10524},{"$f":"SUMIFS(donnees!$G$2:$G$420,donnees!$D$2:$D$420,nomRegions!$R34,donnees!$C$2:$C$420,nomRegions!$Q34)","v":6651}]
[{"$nulls":10},"Fromage",{"$f":"SUMIF(donnees!$D$2:$D$420,nomRegions!$K35,donnees!$E$2:$E$420)","v":300434.19999999984},{"$f":"SUMIF(donnees!$D$2:$D$420,nomRegions!$K35,donnees!$G$2:$G$420)","v":318894.60000000003},{"$f":"K35","v":"Fromage"},null,"Corse35","Corse","Sucre",{"$f":"SUMIFS(donnees!$E$2:$E$420,donnees!$D$2:$D$420,nomRegions!$R35,donnees!$C$2:$C$420,nomRegions!$Q35)","v":9183.850000000002},{"$f":"SUMIFS(donnees!$G$2:$G$420,donnees!$D$2:$D$420,nomRegions!$R35,donnees!$C$2:$C$420,nomRegions!$Q35)","v":3508.3700000000003}]
[{"$nulls":10},"Lait",{"$f":"SUMIF(donnees!$D$2:$D$420,nomRegions!$K36,donnees!$E$2:$E$420)","v":401805},{"$f":"SUMIF(donnees!$D$2:$D$420,nomRegions!$K36,donnees!$G$2:$G$420)","v":419412},{"$f":"K36","v":"Lait"},null,"Corse36","Corse","Yaourt",{"$f":"SUMIFS(donnees!$E$2:$E$420,donnees!$D$2:$D$420,nomRegions!$R36,donnees!$C$2:$C$420,nomRegions!$Q36)","v":4596},{"$f":"SUMIFS(donnees!$G$2:$G$420,donnees!$D$2:$D$420,nomRegions!$R36,donnees!$C$2:$C$420,nomRegions!$Q36)","v":2715}]
[{"$nulls":10},"Riz",{"$f":"SUMIF(donnees!$D$2:$D$420,nomRegions!$K37,donnees!$E$2:$E$420)","v":459363},{"$f":"SUMIF(donnees!$D$2:$D$420,nomRegions!$K37,donnees!$G$2:$G$420)","v":435645},"Riz",null,"Île-de-France37","Île-de-France","Fromage",{"$f":"SUMIFS(donnees!$E$2:$E$420,donnees!$D$2:$D$420,nomRegions!$R37,donnees!$C$2:$C$420,nomRegions!$Q37)","v":6934.4000000000015},{"$f":"SUMIFS(donnees!$G$2:$G$420,donnees!$D$2:$D$420,nomRegions!$R37,donnees!$C$2:$C$420,nomRegions!$Q37)","v":16700.2}]
[{"$nulls":10},"Sucre",{"$f":"SUMIF(donnees!$D$2:$D$420,nomRegions!$K38,donnees!$E$2:$E$420)","v":276365.23},{"$f":"SUMIF(donnees!$D$2:$D$420,nomRegions!$K38,donnees!$G$2:$G$420)","v":291696.19000000006},"Sucre",null,"Île-de-France38","Île-de-France","Lait",{"$f":"SUMIFS(donnees!$E$2:$E$420,donnees!$D$2:$D$420,nomRegions!$R38,donnees!$C$2:$C$420,nomRegions!$Q38)","v":42087},{"$f":"SUMIFS(donnees!$G$2:$G$420,donnees!$D$2:$D$420,nomRegions!$R38,donnees!$C$2:$C$420,nomRegions!$Q38)","v":41445}]
[{"$nulls":10},"Yaourt",{"$f":"SUMIF(donnees!$D$2:$D$420,nomRegions!$K39,donnees!$E$2:$E$420)","v":190107},{"$f":"SUMIF(donnees!$D$2:$D$420,nomRegions!$K39,donnees!$G$2:$G$420)","v":222696},"Yaourt",null,"Île-de-France39","Île-de-France","Riz",{"$f":"SUMIFS(donnees!$E$2:$E$420,donnees!$D$2:$D$420,nomRegions!$R39,donnees!$C$2:$C$420,nomRegions!$Q39)","v":42111},{"$f":"SUMIFS(donnees!$G$2:$G$420,donnees!$D$2:$D$420,nomRegions!$R39,donnees!$C$2:$C$420,nomRegions!$Q39)","v":32094}]
[{"$nulls":10},"total",{"$f":"SUM(L35:L39)","v":{"v":1628074.4299999997,"d":"1,628,074.43 $"}},{"$f":"SUM(M35:M39)","v":{"v":1688343.79,"d":"1,688,343.79 $"}},null,null,"Île-de-France40","Île-de-France","Sucre",{"$f":"SUMIFS(donnees!$E$2:$E$420,donnees!$D$2:$D$420,nomRegions!$R40,donnees!$C$2:$C$420,nomRegions!$Q40)","v":14467.300000000001},{"$f":"SUMIFS(donnees!$G$2:$G$420,donnees!$D$2:$D$420,nomRegions!$R40,donnees!$C$2:$C$420,nomRegions!$Q40)","v":16672.22}]
[{"$nulls":15},"Île-de-France41","Île-de-France","Yaourt",{"$f":"SUMIFS(donnees!$E$2:$E$420,donnees!$D$2:$D$420,nomRegions!$R41,donnees!$C$2:$C$420,nomRegions!$Q41)","v":20850},{"$f":"SUMIFS(donnees!$G$2:$G$420,donnees!$D$2:$D$420,nomRegions!$R41,donnees!$C$2:$C$420,nomRegions!$Q41)","v":17682}]
[{"$nulls":15},"Languedoc-Roussillon-Midi-Pyrénées42","Languedoc-Roussillon-Midi-Pyrénées","Fromage",{"$f":"SUMIFS(donnees!$E$2:$E$420,donnees!$D$2:$D$420,nomRegions!$R42,donnees!$C$2:$C$420,nomRegions!$Q42)","v":48846.600000000006},{"$f":"SUMIFS(donnees!$G$2:$G$420,donnees!$D$2:$D$420,nomRegions!$R42,donnees!$C$2:$C$420,nomRegions!$Q42)","v":46050.399999999994}]
[{"$nulls":15},"Languedoc-Roussillon-Midi-Pyrénées43","Languedoc-Roussillon-Midi-Pyrénées","Lait",{"$f":"SUMIFS(donnees!$E$2:$E$420,donnees!$D$2:$D$420,nomRegions!$R43,donnees!$C$2:$C$420,nomRegions!$Q43)","v":52122},{"$f":"SUMIFS(donnees!$G$2:$G$420,donnees!$D$2:$D$420,nomRegions!$R43,donnees!$C$2:$C$420,nomRegions!$Q43)","v":62547}]
[{"$nulls":15},"Languedoc-Roussillon-Midi-Pyrénées44","Languedoc-Roussillon-Midi-Pyrénées","Riz",{"$f":"SUMIFS(donnees!$E$2:$E$420,donnees!$D$2:$D$420,nomRegions!$R44,donnees!$C$2:$C$420,nomRegions!$Q44)","v":55569},{"$f":"SUMIFS(donnees!$G$2:$G$420,donnees!$D$2:$D$420,nomRegions!$R44,donnees!$C$2:$C$420,nomRegions!$Q44)","v":58782}]
[{"$nulls":15},"Languedoc-Roussillon-Midi-Pyrénées45","Languedoc-Roussillon-Midi-Pyrénées","Sucre",{"$f":"SUMIFS(donnees!$E$2:$E$420,donnees!$D$2:$D$420,nomRegions!$R45,donnees!$C$2:$C$420,nomRegions!$Q45)","v":40824.850000000006},{"$f":"SUMIFS(donnees!$G$2:$G$420,donnees!$D$2:$D$420,nomRegions!$R45,donnees!$C$2:$C$420,nomRegions!$Q45)","v":41923.329999999994}]
[{"$nulls":15},"Languedoc-Roussillon-Midi-Pyrénées46","Languedoc-Roussillon-Midi-Pyrénées","Yaourt",{"$f":"SUMIFS(donnees!$E$2:$E$420,donnees!$D$2:$D$420,nomRegions!$R46,donnees!$C$2:$C$420,nomRegions!$Q46)","v":28329},{"$f":"SUMIFS(donnees!$G$2:$G$420,donnees!$D$2:$D$420,nomRegions!$R46,donnees!$C$2:$C$420,nomRegions!$Q46)","v":34035}]
[{"$nulls":15},"Nord-Pas-de-Calais-Picardie47","Nord-Pas-de-Calais-Picardie","Fromage",{"$f":"SUMIFS(donnees!$E$2:$E$420,donnees!$D$2:$D$420,nomRegions!$R47,donnees!$C$2:$C$420,nomRegions!$Q47)","v":15272.4},{"$f":"SUMIFS(donnees!$G$2:$G$420,donnees!$D$2:$D$420,nomRegions!$R47,donnees!$C$2:$C$420,nomRegions!$Q47)","v":17452.600000000002}]
[{"$nulls":15},"Nord-Pas-de-Calais-Picardie48","Nord-Pas-de-Calais-Picardie","Lait",{"$f":"SUMIFS(donnees!$E$2:$E$420,donnees!$D$2:$D$420,nomRegions!$R48,donnees!$C$2:$C$420,nomRegions!$Q48)","v":12039},{"$f":"SUMIFS(donnees!$G$2:$G$420,donnees!$D$2:$D$420,nomRegions!$R48,donnees!$C$2:$C$420,nomRegions!$Q48)","v":20583}]
[{"$nulls":15},"Nord-Pas-de-Calais-Picardie49","Nord-Pas-de-Calais-Picardie","Riz",{"$f":"SUMIFS(donnees!$E$2:$E$420,donnees!$D$2:$D$420,nomRegions!$R49,donnees!$C$2:$C$420,nomRegions!$Q49)","v":22506},{"$f":"SUMIFS(donnees!$G$2:$G$420,donnees!$D$2:$D$420,nomRegions!$R49,donnees!$C$2:$C$420,nomRegions!$Q49)","v":26187}]
[{"$nulls":15},"Nord-Pas-de-Calais-Picardie50","Nord-Pas-de-Calais-Picardie","Sucre",{"$f":"SUMIFS(donnees!$E$2:$E$420,donnees!$D$2:$D$420,nomRegions!$R50,donnees!$C$2:$C$420,nomRegions!$Q50)","v":8513.220000000001},{"$f":"SUMIFS(donnees!$G$2:$G$420,donnees!$D$2:$D$420,nomRegions!$R50,donnees!$C$2:$C$420,nomRegions!$Q50)","v":10634.560000000001}]
[{"$nulls":15},"Nord-Pas-de-Calais-Picardie51","Nord-Pas-de-Calais-Picardie","Yaourt",{"$f":"SUMIFS(donnees!$E$2:$E$420,donnees!$D$2:$D$420,nomRegions!$R51,donnees!$C$2:$C$420,nomRegions!$Q51)","v":8019},{"$f":"SUMIFS(donnees!$G$2:$G$420,donnees!$D$2:$D$420,nomRegions!$R51,donnees!$C$2:$C$420,nomRegions!$Q51)","v":10710}]
[{"$nulls":15},"Normandie52","Normandie","Fromage",{"$f":"SUMIFS(donnees!$E$2:$E$420,donnees!$D$2:$D$420,nomRegions!$R52,donnees!$C$2:$C$420,nomRegions!$Q52)","v":10758},{"$f":"SUMIFS(donnees!$G$2:$G$420,donnees!$D$2:$D$420,nomRegions!$R52,donnees!$C$2:$C$420,nomRegions!$Q52)","v":12278.400000000001}]
[{"$nulls":15},"Normandie53","Normandie","Lait",{"$f":"SUMIFS(donnees!$E$2:$E$420,donnees!$D$2:$D$420,nomRegions!$R53,donnees!$C$2:$C$420,nomRegions!$Q53)","v":32082},{"$f":"SUMIFS(donnees!$G$2:$G$420,donnees!$D$2:$D$420,nomRegions!$R53,donnees!$C$2:$C$420,nomRegions!$Q53)","v":20472}]
[{"$nulls":15},"Normandie54","Normandie","Riz",{"$f":"SUMIFS(donnees!$E$2:$E$420,donnees!$D$2:$D$420,nomRegions!$R54,donnees!$C$2:$C$420,nomRegions!$Q54)","v":23340},{"$f":"SUMIFS(donnees!$G$2:$G$420,donnees!$D$2:$D$420,nomRegions!$R54,donnees!$C$2:$C$420,nomRegions!$Q54)","v":22515}]
[{"$nulls":15},"Normandie55","Normandie","Sucre",{"$f":"SUMIFS(donnees!$E$2:$E$420,donnees!$D$2:$D$420,nomRegions!$R55,donnees!$C$2:$C$420,nomRegions!$Q55)","v":14865.300000000001},{"$f":"SUMIFS(donnees!$G$2:$G$420,donnees!$D$2:$D$420,nomRegions!$R55,donnees!$C$2:$C$420,nomRegions!$Q55)","v":14610.580000000002}]
[{"$nulls":15},"Normandie56","Normandie","Yaourt",{"$f":"SUMIFS(donnees!$E$2:$E$420,donnees!$D$2:$D$420,nomRegions!$R56,donnees!$C$2:$C$420,nomRegions!$Q56)","v":13008},{"$f":"SUMIFS(donnees!$G$2:$G$420,donnees!$D$2:$D$420,nomRegions!$R56,donnees!$C$2:$C$420,nomRegions!$Q56)","v":14197.5}]
[{"$nulls":15},"Pays de la Loire57","Pays de la Loire","Fromage",{"$f":"SUMIFS(donnees!$E$2:$E$420,donnees!$D$2:$D$420,nomRegions!$R57,donnees!$C$2:$C$420,nomRegions!$Q57)","v":16788.2},{"$f":"SUMIFS(donnees!$G$2:$G$420,donnees!$D$2:$D$420,nomRegions!$R57,donnees!$C$2:$C$420,nomRegions!$Q57)","v":18532.800000000003}]
[{"$nulls":15},"Pays de la Loire58","Pays de la Loire","Lait",{"$f":"SUMIFS(donnees!$E$2:$E$420,donnees!$D$2:$D$420,nomRegions!$R58,donnees!$C$2:$C$420,nomRegions!$Q58)","v":22776},{"$f":"SUMIFS(donnees!$G$2:$G$420,donnees!$D$2:$D$420,nomRegions!$R58,donnees!$C$2:$C$420,nomRegions!$Q58)","v":22470}]
[{"$nulls":15},"Pays de la Loire59","Pays de la Loire","Riz",{"$f":"SUMIFS(donnees!$E$2:$E$420,donnees!$D$2:$D$420,nomRegions!$R59,donnees!$C$2:$C$420,nomRegions!$Q59)","v":34902},{"$f":"SUMIFS(donnees!$G$2:$G$420,donnees!$D$2:$D$420,nomRegions!$R59,donnees!$C$2:$C$420,nomRegions!$Q59)","v":28317}]
[{"$nulls":15},"Pays de la Loire60","Pays de la Loire","Sucre",{"$f":"SUMIFS(donnees!$E$2:$E$420,donnees!$D$2:$D$420,nomRegions!$R60,donnees!$C$2:$C$420,nomRegions!$Q60)","v":10383.820000000002},{"$f":"SUMIFS(donnees!$G$2:$G$420,donnees!$D$2:$D$420,nomRegions!$R60,donnees!$C$2:$C$420,nomRegions!$Q60)","v":16449.340000000004}]
[{"$nulls":15},"Pays de la Loire61","Pays de la Loire","Yaourt",{"$f":"SUMIFS(donnees!$E$2:$E$420,donnees!$D$2:$D$420,nomRegions!$R61,donnees!$C$2:$C$420,nomRegions!$Q61)","v":10185},{"$f":"SUMIFS(donnees!$G$2:$G$420,donnees!$D$2:$D$420,nomRegions!$R61,donnees!$C$2:$C$420,nomRegions!$Q61)","v":12445.5}]
[{"$nulls":15},"Provence-Alpes-Côte d'Azur62","Provence-Alpes-Côte d'Azur","Fromage",{"$f":"SUMIFS(donnees!$E$2:$E$420,donnees!$D$2:$D$420,nomRegions!$R62,donnees!$C$2:$C$420,nomRegions!$Q62)","v":26932.4},{"$f":"SUMIFS(donnees!$G$2:$G$420,donnees!$D$2:$D$420,nomRegions!$R62,donnees!$C$2:$C$420,nomRegions!$Q62)","v":19208.2}]
[{"$nulls":15},"Provence-Alpes-Côte d'Azur63","Provence-Alpes-Côte d'Azur","Lait",{"$f":"SUMIFS(donnees!$E$2:$E$420,donnees!$D$2:$D$420,nomRegions!$R63,donnees!$C$2:$C$420,nomRegions!$Q63)","v":22164},{"$f":"SUMIFS(donnees!$G$2:$G$420,donnees!$D$2:$D$420,nomRegions!$R63,donnees!$C$2:$C$420,nomRegions!$Q63)","v":28188}]
[{"$nulls":15},"Provence-Alpes-Côte d'Azur64","Provence-Alpes-Côte d'Azur","Riz",{"$f":"SUMIFS(donnees!$E$2:$E$420,donnees!$D$2:$D$420,nomRegions!$R64,donnees!$C$2:$C$420,nomRegions!$Q64)","v":28476},{"$f":"SUMIFS(donnees!$G$2:$G$420,donnees!$D$2:$D$420,nomRegions!$R64,donnees!$C$2:$C$420,nomRegions!$Q64)","v":24720}]
[{"$nulls":15},"Provence-Alpes-Côte d'Azur65","Provence-Alpes-Côte d'Azur","Sucre",{"$f":"SUMIFS(donnees!$E$2:$E$420,donnees!$D$2:$D$420,nomRegions!$R65,donnees!$C$2:$C$420,nomRegions!$Q65)","v":15579.710000000001},{"$f":"SUMIFS(donnees!$G$2:$G$420,donnees!$D$2:$D$420,nomRegions!$R65,donnees!$C$2:$C$420,nomRegions!$Q65)","v":11908.160000000002}]
[{"$nulls":15},"Provence-Alpes-Côte d'Azur66","Provence-Alpes-Côte d'Azur","Yaourt",{"$f":"SUMIFS(donnees!$E$2:$E$420,donnees!$D$2:$D$420,nomRegions!$R66,donnees!$C$2:$C$420,nomRegions!$Q66)","v":10732.5},{"$f":"SUMIFS(donnees!$G$2:$G$420,donnees!$D$2:$D$420,nomRegions!$R66,donnees!$C$2:$C$420,nomRegions!$Q66)","v":16534.5}]

{"sheet":"nomDept","index":8,"n_rows":420,"n_cols":20,"rows_kept":420,"hidden":true}
["numDept","nomDept","Cibles","Résultat",null,null,"numDept",{"$nulls":9},"nomDept","nomProd",2014,2015]
[1,"Ain",{"$f":"SUMIF(donnees!$B$2:$B$420,$B2,donnees!$F$2:$F$420)","v":{"v":30391.3,"d":"30,391.30 $"}},{"$f":"SUMIF(donnees!$B$2:$B$420,$B2,donnees!$G$2:$G$420)","v":{"v":22634.739999999998,"d":"22,634.74 $"}},{"$f":"VLOOKUP(D2/C2,classeReg,4,1)","v":"classe0"},{"$f":"D2/C2","v":0.7447769591955592},1,{"$f":"B2&\" (\"&G2&\")\"","v":"Ain (1)"},"txtHexagone",{"$nulls":6},{"$f":"Q2&ROW()","v":"Ain2"},"Ain","Fromage",{"$f":"donnees!E2","v":{"v":2730.2000000000003,"d":"2,730 $"}},{"$f":"donnees!G2","v":{"v":4928,"d":"4,928 $"}}]
[2,"Aisne",{"$f":"SUMIF(donnees!$B$2:$B$420,$B3,donnees!$F$2:$F$420)","v":{"v":17845.18,"d":"17,845.18 $"}},{"$f":"SUMIF(donnees!$B$2:$B$420,$B3,donnees!$G$2:$G$420)","v":{"v":12222.5,"d":"12,222.50 $"}},"classe0",{"$f":"D3/C3","v":0.6849188408298488},2,{"$f":"B3&\" (\"&G3&\")\"","v":"Aisne (2)"},{"$nulls":7},{"$f":"Q3&ROW()","v":"Ain3"},"Ain","Lait",{"$f":"donnees!E3","v":{"v":4743,"d":"4,743 $"}},{"$f":"donnees!G3","v":{"v":3996,"d":"3,996 $"}}]
[3,"Allier",{"$f":"SUMIF(donnees!$B$2:$B$420,$B4,donnees!$F$2:$F$420)","v":{"v":29301.850000000002,"d":"29,301.85 $"}},{"$f":"SUMIF(donnees!$B$2:$B$420,$B4,donnees!$G$2:$G$420)","v":{"v":21360.24,"d":"21,360.24 $"}},"classe0",0.7289724027663782,3,"Allier (3)",{"$nulls":7},"Ain4","Ain","Sucre",{"$f":"donnees!E4","v":{"v":7960,"d":"7,960 $"}},{"$f":"donnees!G4","v":{"v":4230.74,"d":"4,231 $"}}]
[4,"Alpes-de-Haute-Provence",{"$f":"SUMIF(donnees!$B$2:$B$420,$B5,donnees!$F$2:$F$420)","v":{"v":25660.54,"d":"25,660.54 $"}},{"$f":"SUMIF(donnees!$B$2:$B$420,$B5,donnees!$G$2:$G$420)","v":{"v":13672.3,"d":"13,672.30 $"}},"classe0",0.5328141964276667,4,"Alpes-de-Haute-Provence (4)",{"$nulls":7},"Ain5","Ain","Riz",{"$f":"donnees!E5","v":{"v":6294,"d":"6,294 $"}},{"$f":"donnees!G5","v":{"v":6750,"d":"6,750 $"}}]
[5,"Hautes-Alpes",{"$f":"SUMIF(donnees!$B$2:$B$420,$B6,donnees!$F$2:$F$420)","v":{"v":9114,"d":"9,114.00 $"}},{"$f":"SUMIF(donnees!$B$2:$B$420,$B6,donnees!$G$2:$G$420)","v":{"v":14565,"d":"14,565.00 $"}},"classe3",1.5980908492429229,5,"Hautes-Alpes (5)",null,{"$f":"IFERROR(VLOOKUP(idDept,$A$2:$B$97,2,0),\"\")","v":""},{"$nulls":5},"Ain6","Ain","Yaourt",{"$f":"donnees!E6","v":{"v":3601.5,"d":"3,602 $"}},{"$f":"donnees!G6","v":{"v":2730,"d":"2,730 $"}}]
[6,"Alpes-Maritimes",{"$f":"SUMIF(donnees!$B$2:$B$420,$B7,donnees!$F$2:$F$420)","v":{"v":23161.9,"d":"23,161.90 $"}},{"$f":"SUMIF(donnees!$B$2:$B$420,$B7,donnees!$G$2:$G$420)","v":{"v":13846.220000000001,"d":"13,846.22 $"}},"classe0",0.5978015620480185,6,"Alpes-Maritimes (6)",null,null,"nomDept","nomProd",2014,2015,null,"Aisne7","Aisne","Riz",{"$f":"donnees!E7","v":{"v":7086,"d":"7,086 $"}},{"$f":"donnees!G7","v":{"v":4116,"d":"4,116 $"}}]
[7,"Ardèche",{"$f":"SUMIF(donnees!$B$2:$B$420,$B8,donnees!$F$2:$F$420)","v":{"v":18555.24,"d":"18,555.24 $"}},{"$f":"SUMIF(donnees!$B$2:$B$420,$B8,donnees!$G$2:$G$420)","v":{"v":22981.6,"d":"22,981.60 $"}},"classe3",1.238550404090704,7,"Ardèche (7)",null,null,{"$f":"IFERROR($J$6& MATCH($J$6,$Q:$Q,0),\"\")","v":""},{"$f":"IFERROR(VLOOKUP($K8,detailsDept,COLUMN(S1)-COLUMN($P$1),0),\"\")","v":""},"","",null,{"$f":"Q8&ROW()","v":"Aisne8"},"Aisne","Fromage",{"$f":"donnees!E8","v":{"v":2415.6000000000004,"d":"2,416 $"}},{"$f":"donnees!G8","v":{"v":2499.2000000000003,"d":"2,499 $"}}]
[8,"Ardennes",{"$f":"SUMIF(donnees!$B$2:$B$420,$B9,donnees!$F$2:$F$420)","v":{"v":29108.6,"d":"29,108.60 $"}},{"$f":"SUMIF(donnees!$B$2:$B$420,$B9,donnees!$G$2:$G$420)","v":{"v":12933.7,"d":"12,933.70 $"}},"classe0",0.44432573191427965,8,"Ardennes (8)",null,null,{"$f":"IFERROR($J$6& MATCH($J$6,$Q:$Q,0)+ROW(O1),\"\")","v":""},"","","",null,{"$f":"Q9&ROW()","v":"Aisne9"},"Aisne","Sucre",{"$f":"donnees!E9","v":{"v":5012.810000000001,"d":"5,013 $"}},{"$f":"donnees!G9","v":{"v":3223.8,"d":"3,224 $"}}]
[9,"Ariège",{"$f":"SUMIF(donnees!$B$2:$B$420,$B10,donnees!$F$2:$F$420)","v":{"v":21028.5,"d":"21,028.50 $"}},{"$f":"SUMIF(donnees!$B$2:$B$420,$B10,donnees!$G$2:$G$420)","v":{"v":19168.76,"d":"19,168.76 $"}},"classe2",0.9115609767696221,9,"Ariège (9)",null,null,{"$f":"IFERROR($J$6& MATCH($J$6,$Q:$Q,0)+ROW(O2),\"\")","v":""},"","","",null,"Aisne10","Aisne","Yaourt",{"$f":"donnees!E10","v":{"v":360,"d":"360 $"}},{"$f":"donnees!G10","v":{"v":2383.5,"d":"2,384 $"}}]
[10,"Aube",{"$f":"SUMIF(donnees!$B$2:$B$420,$B11,donnees!$F$2:$F$420)","v":{"v":34731.62,"d":"34,731.62 $"}},{"$f":"SUMIF(donnees!$B$2:$B$420,$B11,donnees!$G$2:$G$420)","v":{"v":21372.43,"d":"21,372.43 $"}},"classe0",0.6153594332772269,10,"Aube (10)",null,null,"","","","",null,"Allier11","Allier","Sucre",{"$f":"donnees!E11","v":{"v":2911.37,"d":"2,911 $"}},{"$f":"donnees!G11","v":{"v":2220.84,"d":"2,221 $"}}]
[11,"Aude",{"$f":"SUMIF(donnees!$B$2:$B$420,$B12,donnees!$F$2:$F$420)","v":{"v":21175.29,"d":"21,175.29 $"}},{"$f":"SUMIF(donnees!$B$2:$B$420,$B12,donnees!$G$2:$G$420)","v":{"v":16111.27,"d":"16,111.27 $"}},"classe1",0.7608523897429503,11,"Aude (11)",null,null,"","","","",null,"Allier12","Allier","Fromage",{"$f":"donnees!E12","v":{"v":4138.200000000001,"d":"4,138 $"}},{"$f":"donnees!G12","v":{"v":5570.400000000001,"d":"5,570 $"}}]
[12,"Aveyron",{"$f":"SUMIF(donnees!$B$2:$B$420,$B13,donnees!$F$2:$F$420)","v":{"v":10753.18,"d":"10,753.18 $"}},{"$f":"SUMIF(donnees!$B$2:$B$420,$B13,donnees!$G$2:$G$420)","v":{"v":8645.52,"d":"8,645.52 $"}},"classe1",0.8039965851961931,12,"Aveyron (12)",{"$nulls":3},"total",{"$f":"SUM(M8:M12)","v":0},{"$f":"SUM(N8:N12)","v":0},null,"Allier13","Allier","Yaourt",{"$f":"donnees!E13","v":{"v":561,"d":"561 $"}},{"$f":"donnees!G13","v":{"v":3267,"d":"3,267 $"}}]
[13,"Bouches-du-Rhône",{"$f":"SUMIF(donnees!$B$2:$B$420,$B14,donnees!$F$2:$F$420)","v":{"v":37246,"d":"37,246.00 $"}},{"$f":"SUMIF(donnees!$B$2:$B$420,$B14,donnees!$G$2:$G$420)","v":{"v":19259.23,"d":"19,259.23 $"}},"classe0",0.5170818342909306,13,"Bouches-du-Rhône (13)",null,{"$f":"IF(actDept=\"\",\"\",actDept &\": Répartion du CA en \" &N7)","v":""},{"$nulls":3},{"$f":"IFERROR(VLOOKUP(actDept,$B$2:$C$97,2,0),\"\")","v":""},null,"Allier14","Allier","Lait",{"$f":"donnees!E14","v":{"v":8595,"d":"8,595 $"}},{"$f":"donnees!G14","v":{"v":4230,"d":"4,230 $"}}]
[14,"Calvados",{"$f":"SUMIF(donnees!$B$2:$B$420,$B15,donnees!$F$2:$F$420)","v":{"v":15861,"d":"15,861.00 $"}},{"$f":"SUMIF(donnees!$B$2:$B$420,$B15,donnees!$G$2:$G$420)","v":{"v":16418,"d":"16,418.00 $"}},"classe3",1.0351175840110964,14,"Calvados (14)",null,{"$f":"IF(actDept=\"\",\"\",actDept &\": comparaison du CA\")","v":""},{"$nulls":5},"Allier15","Allier","Riz",{"$f":"donnees!E15","v":{"v":8217,"d":"8,217 $"}},{"$f":"donnees!G15","v":{"v":6072,"d":"6,072 $"}}]
[15,"Cantal",{"$f":"SUMIF(donnees!$B$2:$B$420,$B16,donnees!$F$2:$F$420)","v":{"v":21293.8,"d":"21,293.80 $"}},{"$f":"SUMIF(donnees!$B$2:$B$420,$B16,donnees!$G$2:$G$420)","v":{"v":12619.8,"d":"12,619.80 $"}},"classe0",0.5926513820924401,15,"Cantal (15)",{"$nulls":7},"Alpes-de-Haute-Provence16","Alpes-de-Haute-Provence","Riz",{"$f":"donnees!E16","v":{"v":7941,"d":"7,941 $"}},{"$f":"donnees!G16","v":{"v":4590,"d":"4,590 $"}}]
[16,"Charente",{"$f":"SUMIF(donnees!$B$2:$B$420,$B17,donnees!$F$2:$F$420)","v":{"v":19121.190000000002,"d":"19,121.19 $"}},{"$f":"SUMIF(donnees!$B$2:$B$420,$B17,donnees!$G$2:$G$420)","v":{"v":18915.670000000002,"d":"18,915.67 $"}},"classe2",0.9892517149821742,16,"Charente (16)",{"$nulls":7},"Alpes-de-Haute-Provence17","Alpes-de-Haute-Provence","Lait",{"$f":"donnees!E17","v":{"v":6306,"d":"6,306 $"}},{"$f":"donnees!G17","v":{"v":3003,"d":"3,003 $"}}]
[17,"Charente-Maritime",{"$f":"SUMIF(donnees!$B$2:$B$420,$B18,donnees!$F$2:$F$420)","v":{"v":35926.240000000005,"d":"35,926.24 $"}},{"$f":"SUMIF(donnees!$B$2:$B$420,$B18,donnees!$G$2:$G$420)","v":{"v":15619.07,"d":"15,619.07 $"}},"classe0",0.4347538178222936,17,"Charente-Maritime (17)",null,{"$f":"actDept & \" (\" & VLOOKUP(actDept,$B$2:$G$97,6,0)&\")\"","v":{"$error":"#N/A"}},{"$nulls":5},"Alpes-de-Haute-Provence18","Alpes-de-Haute-Provence","Sucre",{"$f":"donnees!E18","v":{"v":1635.7800000000002,"d":"1,636 $"}},{"$f":"donnees!G18","v":{"v":1890.5,"d":"1,891 $"}}]
[18,"Cher",{"$f":"SUMIF(donnees!$B$2:$B$420,$B19,donnees!$F$2:$F$420)","v":{"v":24030.180000000004,"d":"24,030.18 $"}},{"$f":"SUMIF(donnees!$B$2:$B$420,$B19,donnees!$G$2:$G$420)","v":{"v":18548.53,"d":"18,548.53 $"}},"classe1",0.7718847715664218,18,"Cher (18)",{"$nulls":7},"Alpes-de-Haute-Provence19","Alpes-de-Haute-Provence","Fromage",{"$f":"donnees!E19","v":{"v":5504.400000000001,"d":"5,504 $"}},{"$f":"donnees!G19","v":{"v":4188.8,"d":"4,189 $"}}]
[19,"Corrèze",{"$f":"SUMIF(donnees!$B$2:$B$420,$B20,donnees!$F$2:$F$420)","v":{"v":23553.17,"d":"23,553.17 $"}},{"$f":"SUMIF(donnees!$B$2:$B$420,$B20,donnees!$G$2:$G$420)","v":{"v":17349.68,"d":"17,349.68 $"}},"classe0",0.7366176187748826,19,"Corrèze (19)",{"$nulls":7},"Alpes-Maritimes20","Alpes-Maritimes","Fromage",{"$f":"donnees!E20","v":{"v":5090.8,"d":"5,091 $"}},{"$f":"donnees!G20","v":{"v":2182.4,"d":"2,182 $"}}]
["2A","Corse-du-Sud",{"$f":"SUMIF(donnees!$B$2:$B$420,$B21,donnees!$F$2:$F$420)","v":{"v":11702.89,"d":"11,702.89 $"}},{"$f":"SUMIF(donnees!$B$2:$B$420,$B21,donnees!$G$2:$G$420)","v":{"v":8722.84,"d":"8,722.84 $"}},"classe0",0.7453577706019625,"2A","Corse-du-Sud (2A)",{"$nulls":7},"Alpes-Maritimes21","Alpes-Maritimes","Sucre",{"$f":"donnees!E21","v":{"v":5771,"d":"5,771 $"}},{"$f":"donnees!G21","v":{"v":2423.8200000000006,"d":"2,424 $"}}]
["2B","Haute-Corse",{"$f":"SUMIF(donnees!$B$2:$B$420,$B22,donnees!$F$2:$F$420)","v":{"v":29554.940000000002,"d":"29,554.94 $"}},{"$f":"SUMIF(donnees!$B$2:$B$420,$B22,donnees!$G$2:$G$420)","v":{"v":16040.73,"d":"16,040.73 $"}},"classe0",0.5427427699058093,"2B","Haute-Corse (2B)",{"$nulls":7},"Alpes-Maritimes22","Alpes-Maritimes","Riz",{"$f":"donnees!E22","v":{"v":4755,"d":"4,755 $"}},{"$f":"donnees!G22","v":{"v":5484,"d":"5,484 $"}}]
[21,"Côte-d'Or",{"$f":"SUMIF(donnees!$B$2:$B$420,$B23,donnees!$F$2:$F$420)","v":{"v":30144.07,"d":"30,144.07 $"}},{"$f":"SUMIF(donnees!$B$2:$B$420,$B23,donnees!$G$2:$G$420)","v":{"v":16608.22,"d":"16,608.22 $"}},"classe0",0.5509614328788383,21,"Côte-d'Or (21)",{"$nulls":7},"Alpes-Maritimes23","Alpes-Maritimes","Yaourt",{"$f":"donnees!E23","v":{"v":3687,"d":"3,687 $"}},{"$f":"donnees!G23","v":{"v":3756,"d":"3,756 $"}}]
[22,"Côtes-d'Armor",{"$f":"SUMIF(donnees!$B$2:$B$420,$B24,donnees!$F$2:$F$420)","v":{"v":9667.04,"d":"9,667.04 $"}},{"$f":"SUMIF(donnees!$B$2:$B$420,$B24,donnees!$G$2:$G$420)","v":{"v":7865.870000000001,"d":"7,865.87 $"}},"classe1",0.8136792648008077,22,"Côtes-d'Armor (22)",{"$nulls":7},"Ardèche24","Ardèche","Yaourt",{"$f":"donnees!E24","v":{"v":1216.5,"d":"1,217 $"}},{"$f":"donnees!G24","v":{"v":2409,"d":"2,409 $"}}]
[23,"Creuse",{"$f":"SUMIF(donnees!$B$2:$B$420,$B25,donnees!$F$2:$F$420)","v":{"v":22589.8,"d":"22,589.80 $"}},{"$f":"SUMIF(donnees!$B$2:$B$420,$B25,donnees!$G$2:$G$420)","v":{"v":17807.690000000002,"d":"17,807.69 $"}},"classe1",0.7883066693817565,23,"Creuse (23)",{"$nulls":7},"Ardèche25","Ardèche","Fromage",{"$f":"donnees!E25","v":{"v":1742.4,"d":"1,742 $"}},{"$f":"donnees!G25","v":{"v":5440.6,"d":"5,441 $"}}]
[24,"Dordogne",{"$f":"SUMIF(donnees!$B$2:$B$420,$B26,donnees!$F$2:$F$420)","v":{"v":10664.740000000002,"d":"10,664.74 $"}},{"$f":"SUMIF(donnees!$B$2:$B$420,$B26,donnees!$G$2:$G$420)","v":{"v":17039.13,"d":"17,039.13 $"}},"classe3",1.597707023331089,24,"Dordogne (24)",{"$nulls":7},"Ardèche26","Ardèche","Lait",{"$f":"donnees!E26","v":{"v":900,"d":"900 $"}},{"$f":"donnees!G26","v":{"v":6264,"d":"6,264 $"}}]
[25,"Doubs",{"$f":"SUMIF(donnees!$B$2:$B$420,$B27,donnees!$F$2:$F$420)","v":{"v":12076.75,"d":"12,076.75 $"}},{"$f":"SUMIF(donnees!$B$2:$B$420,$B27,donnees!$G$2:$G$420)","v":{"v":12669.67,"d":"12,669.67 $"}},"classe3",1.0490959902291594,25,"Doubs (25)",{"$nulls":7},"Ardèche27","Ardèche","Riz",{"$f":"donnees!E27","v":{"v":5262,"d":"5,262 $"}},{"$f":"donnees!G27","v":{"v":7077,"d":"7,077 $"}}]
[26,"Drôme",{"$f":"SUMIF(donnees!$B$2:$B$420,$B28,donnees!$F$2:$F$420)","v":{"v":10825.09,"d":"10,825.09 $"}},{"$f":"SUMIF(donnees!$B$2:$B$420,$B28,donnees!$G$2:$G$420)","v":{"v":23044.85,"d":"23,044.85 $"}},"classe3",2.1288368041281873,26,"Drôme (26)",{"$nulls":7},"Ardèche28","Ardèche","Sucre",{"$f":"donnees!E28","v":{"v":6346.110000000001,"d":"6,346 $"}},{"$f":"donnees!G28","v":{"v":1791,"d":"1,791 $"}}]
[27,"Eure",{"$f":"SUMIF(donnees!$B$2:$B$420,$B29,donnees!$F$2:$F$420)","v":{"v":23412.21,"d":"23,412.21 $"}},{"$f":"SUMIF(donnees!$B$2:$B$420,$B29,donnees!$G$2:$G$420)","v":{"v":13070.490000000002,"d":"13,070.49 $"}},"classe0",0.558276642828678,27,"Eure (27)",{"$nulls":7},"Ardennes29","Ardennes","Riz",{"$f":"donnees!E29","v":{"v":9975,"d":"9,975 $"}},{"$f":"donnees!G29","v":{"v":3048,"d":"3,048 $"}}]
[28,"Eure-et-Loir",{"$f":"SUMIF(donnees!$B$2:$B$420,$B30,donnees!$F$2:$F$420)","v":{"v":24923.11,"d":"24,923.11 $"}},{"$f":"SUMIF(donnees!$B$2:$B$420,$B30,donnees!$G$2:$G$420)","v":{"v":20198.23,"d":"20,198.23 $"}},"classe1",0.8104217330822678,28,"Eure-et-Loir (28)",{"$nulls":7},"Ardennes30","Ardennes","Fromage",{"$f":"donnees!E30","v":{"v":3920.4000000000005,"d":"3,920 $"}},{"$f":"donnees!G30","v":{"v":3269.2000000000003,"d":"3,269 $"}}]
[29,"Finistère",{"$f":"SUMIF(donnees!$B$2:$B$420,$B31,donnees!$F$2:$F$420)","v":{"v":9661.2,"d":"9,661.20 $"}},{"$f":"SUMIF(donnees!$B$2:$B$420,$B31,donnees!$G$2:$G$420)","v":{"v":18594.4,"d":"18,594.40 $"}},"classe3",1.9246470417753487,29,"Finistère (29)",{"$nulls":7},"Ardennes31","Ardennes","Yaourt",{"$f":"donnees!E31","v":{"v":3928.5,"d":"3,929 $"}},{"$f":"donnees!G31","v":{"v":1780.5,"d":"1,781 $"}}]
[30,"Gard",{"$f":"SUMIF(donnees!$B$2:$B$420,$B32,donnees!$F$2:$F$420)","v":{"v":19821.020000000004,"d":"19,821.02 $"}},{"$f":"SUMIF(donnees!$B$2:$B$420,$B32,donnees!$G$2:$G$420)","v":{"v":22430.35,"d":"22,430.35 $"}},"classe3",1.1316445874127565,30,"Gard (30)",{"$nulls":7},"Ardennes32","Ardennes","Lait",{"$f":"donnees!E32","v":{"v":6435,"d":"6,435 $"}},{"$f":"donnees!G32","v":{"v":4836,"d":"4,836 $"}}]
[31,"Haute-Garonne",{"$f":"SUMIF(donnees!$B$2:$B$420,$B33,donnees!$F$2:$F$420)","v":{"v":11307.68,"d":"11,307.68 $"}},{"$f":"SUMIF(donnees!$B$2:$B$420,$B33,donnees!$G$2:$G$420)","v":{"v":20161.39,"d":"20,161.39 $"}},"classe3",1.7829820086879005,31,"Haute-Garonne (31)",{"$nulls":7},"Ariège33","Ariège","Riz",{"$f":"donnees!E33","v":{"v":6081,"d":"6,081 $"}},{"$f":"donnees!G33","v":{"v":4518,"d":"4,518 $"}}]
[32,"Gers",{"$f":"SUMIF(donnees!$B$2:$B$420,$B34,donnees!$F$2:$F$420)","v":{"v":27272.340000000004,"d":"27,272.34 $"}},{"$f":"SUMIF(donnees!$B$2:$B$420,$B34,donnees!$G$2:$G$420)","v":{"v":20657.480000000003,"d":"20,657.48 $"}},"classe1",0.7574516891473192,32,"Gers (32)",{"$nulls":7},"Ariège34","Ariège","Lait",{"$f":"donnees!E34","v":{"v":7461,"d":"7,461 $"}},{"$f":"donnees!G34","v":{"v":3294,"d":"3,294 $"}}]
[33,"Gironde",{"$f":"SUMIF(donnees!$B$2:$B$420,$B35,donnees!$F$2:$F$420)","v":{"v":22715.18,"d":"22,715.18 $"}},{"$f":"SUMIF(donnees!$B$2:$B$420,$B35,donnees!$G$2:$G$420)","v":{"v":15538.619999999999,"d":"15,538.62 $"}},"classe0",0.6840632563774532,33,"Gironde (33)",{"$nulls":7},"Ariège35","Ariège","Sucre",{"$f":"donnees!E35","v":{"v":465.6600000000001,"d":"466 $"}},{"$f":"donnees!G35","v":{"v":2495.46,"d":"2,495 $"}}]
[34,"Hérault",{"$f":"SUMIF(donnees!$B$2:$B$420,$B36,donnees!$F$2:$F$420)","v":{"v":27691.800000000003,"d":"27,691.80 $"}},{"$f":"SUMIF(donnees!$B$2:$B$420,$B36,donnees!$G$2:$G$420)","v":{"v":17843.67,"d":"17,843.67 $"}},"classe0",0.6443665633869953,34,"Hérault (34)",{"$nulls":7},"Ariège36","Ariège","Yaourt",{"$f":"donnees!E36","v":{"v":1129.5,"d":"1,130 $"}},{"$f":"donnees!G36","v":{"v":3946.5,"d":"3,947 $"}}]
[35,"Ille-et-Vilaine",{"$f":"SUMIF(donnees!$B$2:$B$420,$B37,donnees!$F$2:$F$420)","v":{"v":21636.29,"d":"21,636.29 $"}},{"$f":"SUMIF(donnees!$B$2:$B$420,$B37,donnees!$G$2:$G$420)","v":{"v":20445.63,"d":"20,445.63 $"}},"classe2",0.9449693085089912,35,"Ille-et-Vilaine (35)",{"$nulls":7},"Ariège37","Ariège","Fromage",{"$f":"donnees!E37","v":{"v":2391.4,"d":"2,391 $"}},{"$f":"donnees!G37","v":{"v":4914.8,"d":"4,915 $"}}]
[36,"Indre",{"$f":"SUMIF(donnees!$B$2:$B$420,$B38,donnees!$F$2:$F$420)","v":{"v":22100,"d":"22,100.00 $"}},{"$f":"SUMIF(donnees!$B$2:$B$420,$B38,donnees!$G$2:$G$420)","v":{"v":20162.230000000003,"d":"20,162.23 $"}},"classe2",0.9123180995475114,36,"Indre (36)",{"$nulls":7},"Aube38","Aube","Lait",{"$f":"donnees!E38","v":{"v":11343,"d":"11,343 $"}},{"$f":"donnees!G38","v":{"v":3255,"d":"3,255 $"}}]
[37,"Indre-et-Loire",{"$f":"SUMIF(donnees!$B$2:$B$420,$B39,donnees!$F$2:$F$420)","v":{"v":6110.37,"d":"6,110.37 $"}},{"$f":"SUMIF(donnees!$B$2:$B$420,$B39,donnees!$G$2:$G$420)","v":{"v":11496.8,"d":"11,496.80 $"}},"classe3",1.8815227228465705,37,"Indre-et-Loire (37)",{"$nulls":7},"Aube39","Aube","Yaourt",{"$f":"donnees!E39","v":{"v":4311,"d":"4,311 $"}},{"$f":"donnees!G39","v":{"v":2416.5,"d":"2,417 $"}}]
[38,"Isère",{"$f":"SUMIF(donnees!$B$2:$B$420,$B40,donnees!$F$2:$F$420)","v":{"v":17590.21,"d":"17,590.21 $"}},{"$f":"SUMIF(donnees!$B$2:$B$420,$B40,donnees!$G$2:$G$420)","v":{"v":20124.72,"d":"20,124.72 $"}},"classe3",1.1440863980589204,38,"Isère (38)",{"$nulls":7},"Aube40","Aube","Riz",{"$f":"donnees!E40","v":{"v":9327,"d":"9,327 $"}},{"$f":"donnees!G40","v":{"v":7704,"d":"7,704 $"}}]
[39,"Jura",{"$f":"SUMIF(donnees!$B$2:$B$420,$B41,donnees!$F$2:$F$420)","v":{"v":17919.489999999998,"d":"17,919.49 $"}},{"$f":"SUMIF(donnees!$B$2:$B$420,$B41,donnees!$G$2:$G$420)","v":{"v":18599.64,"d":"18,599.64 $"}},"classe3",1.0379558793246906,39,"Jura (39)",{"$nulls":7},"Aube41","Aube","Fromage",{"$f":"donnees!E41","v":{"v":2211,"d":"2,211 $"}},{"$f":"donnees!G41","v":{"v":3326.4,"d":"3,326 $"}}]
[40,"Landes",{"$f":"SUMIF(donnees!$B$2:$B$420,$B42,donnees!$F$2:$F$420)","v":{"v":25394.730000000003,"d":"25,394.73 $"}},{"$f":"SUMIF(donnees!$B$2:$B$420,$B42,donnees!$G$2:$G$420)","v":{"v":17645.84,"d":"17,645.84 $"}},"classe0",0.6948622804810288,40,"Landes (40)",{"$nulls":7},"Aube42","Aube","Sucre",{"$f":"donnees!E42","v":{"v":1755.1800000000003,"d":"1,755 $"}},{"$f":"donnees!G42","v":{"v":4670.530000000001,"d":"4,671 $"}}]
[41,"Loir-et-Cher",{"$f":"SUMIF(donnees!$B$2:$B$420,$B43,donnees!$F$2:$F$420)","v":{"v":29545.24,"d":"29,545.24 $"}},{"$f":"SUMIF(donnees!$B$2:$B$420,$B43,donnees!$G$2:$G$420)","v":{"v":10230.83,"d":"10,230.83 $"}},"classe0",0.346276760655862,41,"Loir-et-Cher (41)",{"$nulls":7},"Aude43","Aude","Fromage",{"$f":"donnees!E43","v":{"v":6472.400000000001,"d":"6,472 $"}},{"$f":"donnees!G43","v":{"v":2085.6000000000004,"d":"2,086 $"}}]
[42,"Loire",{"$f":"SUMIF(donnees!$B$2:$B$420,$B44,donnees!$F$2:$F$420)","v":{"v":21614.020000000004,"d":"21,614.02 $"}},{"$f":"SUMIF(donnees!$B$2:$B$420,$B44,donnees!$G$2:$G$420)","v":{"v":21936.620000000003,"d":"21,936.62 $"}},"classe3",1.0149254974317594,42,"Loire (42)",{"$nulls":7},"Aude44","Aude","Sucre",{"$f":"donnees!E44","v":{"v":4927.24,"d":"4,927 $"}},{"$f":"donnees!G44","v":{"v":2652.67,"d":"2,653 $"}}]
[43,"Haute-Loire",{"$f":"SUMIF(donnees!$B$2:$B$420,$B45,donnees!$F$2:$F$420)","v":{"v":23878.050000000003,"d":"23,878.05 $"}},{"$f":"SUMIF(donnees!$B$2:$B$420,$B45,donnees!$G$2:$G$420)","v":{"v":23993.120000000003,"d":"23,993.12 $"}},"classe2",1.0048190702339597,43,"Haute-Loire (43)",{"$nulls":7},"Aude45","Aude","Yaourt",{"$f":"donnees!E45","v":{"v":1438.5,"d":"1,439 $"}},{"$f":"donnees!G45","v":{"v":3984,"d":"3,984 $"}}]
[44,"Loire-Atlantique",{"$f":"SUMIF(donnees!$B$2:$B$420,$B46,donnees!$F$2:$F$420)","v":{"v":10822.17,"d":"10,822.17 $"}},{"$f":"SUMIF(donnees!$B$2:$B$420,$B46,donnees!$G$2:$G$420)","v":{"v":20567.1,"d":"20,567.10 $"}},"classe3",1.900459889282833,44,"Loire-Atlantique (44)",{"$nulls":7},"Aude46","Aude","Riz",{"$f":"donnees!E46","v":{"v":4812,"d":"4,812 $"}},{"$f":"donnees!G46","v":{"v":7389,"d":"7,389 $"}}]
[45,"Loiret",{"$f":"SUMIF(donnees!$B$2:$B$420,$B47,donnees!$F$2:$F$420)","v":{"v":15723.500000000002,"d":"15,723.50 $"}},{"$f":"SUMIF(donnees!$B$2:$B$420,$B47,donnees!$G$2:$G$420)","v":{"v":19776.64,"d":"19,776.64 $"}},"classe3",1.257775940471269,45,"Loiret (45)",{"$nulls":7},"Aveyron47","Aveyron","Sucre",{"$f":"donnees!E47","v":{"v":3651.6500000000005,"d":"3,652 $"}},{"$f":"donnees!G47","v":{"v":4632.720000000001,"d":"4,633 $"}}]
[46,"Lot",{"$f":"SUMIF(donnees!$B$2:$B$420,$B48,donnees!$F$2:$F$420)","v":{"v":23079.23,"d":"23,079.23 $"}},{"$f":"SUMIF(donnees!$B$2:$B$420,$B48,donnees!$G$2:$G$420)","v":{"v":21007.41,"d":"21,007.41 $"}},"classe2",0.9102301073302705,46,"Lot (46)",{"$nulls":7},"Aveyron48","Aveyron","Fromage",{"$f":"donnees!E48","v":{"v":5310.8,"d":"5,311 $"}},{"$f":"donnees!G48","v":{"v":4012.8,"d":"4,013 $"}}]
[47,"Lot-et-Garonne",{"$f":"SUMIF(donnees!$B$2:$B$420,$B49,donnees!$F$2:$F$420)","v":{"v":13082.48,"d":"13,082.48 $"}},{"$f":"SUMIF(donnees!$B$2:$B$420,$B49,donnees!$G$2:$G$420)","v":{"v":13957.05,"d":"13,957.05 $"}},"classe3",1.0668504748335177,47,"Lot-et-Garonne (47)",{"$nulls":7},"Bas-Rhin49","Bas-Rhin","Riz",{"$f":"donnees!E49","v":{"v":6132,"d":"6,132 $"}},{"$f":"donnees!G49","v":{"v":7110,"d":"7,110 $"}}]
[48,"Lozère",{"$f":"SUMIF(donnees!$B$2:$B$420,$B50,donnees!$F$2:$F$420)","v":{"v":12488,"d":"12,488.00 $"}},{"$f":"SUMIF(donnees!$B$2:$B$420,$B50,donnees!$G$2:$G$420)","v":{"v":19902.3,"d":"19,902.30 $"}},"classe3",1.5937139654067904,48,"Lozère (48)",{"$nulls":7},"Bas-Rhin50","Bas-Rhin","Lait",{"$f":"donnees!E50","v":{"v":5241,"d":"5,241 $"}},{"$f":"donnees!G50","v":{"v":5346,"d":"5,346 $"}}]
[49,"Maine-et-Loire",{"$f":"SUMIF(donnees!$B$2:$B$420,$B51,donnees!$F$2:$F$420)","v":{"v":30277.17,"d":"30,277.17 $"}},{"$f":"SUMIF(donnees!$B$2:$B$420,$B51,donnees!$G$2:$G$420)","v":{"v":17181.53,"d":"17,181.53 $"}},"classe0",0.567474767291659,49,"Maine-et-Loire (49)",{"$nulls":7},"Bas-Rhin51","Bas-Rhin","Fromage",{"$f":"donnees!E51","v":{"v":2945.8,"d":"2,946 $"}},{"$f":"donnees!G51","v":{"v":2380.4,"d":"2,380 $"}}]
[50,"Manche",{"$f":"SUMIF(donnees!$B$2:$B$420,$B52,donnees!$F$2:$F$420)","v":{"v":21252.55,"d":"21,252.55 $"}},{"$f":"SUMIF(donnees!$B$2:$B$420,$B52,donnees!$G$2:$G$420)","v":{"v":18399.27,"d":"18,399.27 $"}},"classe2",0.8657441107067152,50,"Manche (50)",{"$nulls":7},"Bas-Rhin52","Bas-Rhin","Yaourt",{"$f":"donnees!E52","v":{"v":124.5,"d":"125 $"}},{"$f":"donnees!G52","v":{"v":2239.5,"d":"2,240 $"}}]
[51,"Marne",{"$f":"SUMIF(donnees!$B$2:$B$420,$B53,donnees!$F$2:$F$420)","v":{"v":16547.84,"d":"16,547.84 $"}},{"$f":"SUMIF(donnees!$B$2:$B$420,$B53,donnees!$G$2:$G$420)","v":{"v":23160.05,"d":"23,160.05 $"}},"classe3",1.399581455948329,51,"Marne (51)",{"$nulls":7},"Bas-Rhin53","Bas-Rhin","Sucre",{"$f":"donnees!E53","v":{"v":262.68000000000006,"d":"263 $"}},{"$f":"donnees!G53","v":{"v":3259.620000000001,"d":"3,260 $"}}]
[52,"Haute-Marne",{"$f":"SUMIF(donnees!$B$2:$B$420,$B54,donnees!$F$2:$F$420)","v":{"v":7692.960000000001,"d":"7,692.96 $"}},{"$f":"SUMIF(donnees!$B$2:$B$420,$B54,donnees!$G$2:$G$420)","v":{"v":24162.770000000004,"d":"24,162.77 $"}},"classe3",3.140893752209813,52,"Haute-Marne (52)",{"$nulls":7},"Bouches-du-Rhône54","Bouches-du-Rhône","Riz",{"$f":"donnees!E54","v":{"v":8139,"d":"8,139 $"}},{"$f":"donnees!G54","v":{"v":4614,"d":"4,614 $"}}]
[53,"Mayenne",{"$f":"SUMIF(donnees!$B$2:$B$420,$B55,donnees!$F$2:$F$420)","v":{"v":16578.800000000003,"d":"16,578.80 $"}},{"$f":"SUMIF(donnees!$B$2:$B$420,$B55,donnees!$G$2:$G$420)","v":{"v":22161.08,"d":"22,161.08 $"}},"classe3",1.3367119453760223,53,"Mayenne (53)",{"$nulls":7},"Bouches-du-Rhône55","Bouches-du-Rhône","Yaourt",{"$f":"donnees!E55","v":{"v":2923.5,"d":"2,924 $"}},{"$f":"donnees!G55","v":{"v":3408,"d":"3,408 $"}}]
[54,"Meurthe-et-Moselle",{"$f":"SUMIF(donnees!$B$2:$B$420,$B56,donnees!$F$2:$F$420)","v":{"v":35442.44,"d":"35,442.44 $"}},{"$f":"SUMIF(donnees!$B$2:$B$420,$B56,donnees!$G$2:$G$420)","v":{"v":14598.59,"d":"14,598.59 $"}},"classe0",0.4118957385552462,54,"Meurthe-et-Moselle (54)",{"$nulls":7},"Bouches-du-Rhône56","Bouches-du-Rhône","Fromage",{"$f":"donnees!E56","v":{"v":6085.200000000001,"d":"6,085 $"}},{"$f":"donnees!G56","v":{"v":2805,"d":"2,805 $"}}]
[55,"Meuse",{"$f":"SUMIF(donnees!$B$2:$B$420,$B57,donnees!$F$2:$F$420)","v":{"v":35040.64,"d":"35,040.64 $"}},{"$f":"SUMIF(donnees!$B$2:$B$420,$B57,donnees!$G$2:$G$420)","v":{"v":20060.58,"d":"20,060.58 $"}},"classe0",0.5724946804624573,55,"Meuse (55)",{"$nulls":7},"Bouches-du-Rhône57","Bouches-du-Rhône","Lait",{"$f":"donnees!E57","v":{"v":7626,"d":"7,626 $"}},{"$f":"donnees!G57","v":{"v":6090,"d":"6,090 $"}}]
[56,"Morbihan",{"$f":"SUMIF(donnees!$B$2:$B$420,$B58,donnees!$F$2:$F$420)","v":{"v":20036.010000000002,"d":"20,036.01 $"}},{"$f":"SUMIF(donnees!$B$2:$B$420,$B58,donnees!$G$2:$G$420)","v":{"v":18969.45,"d":"18,969.45 $"}},"classe2",0.946767844495985,56,"Morbihan (56)",{"$nulls":7},"Bouches-du-Rhône58","Bouches-du-Rhône","Sucre",{"$f":"donnees!E58","v":{"v":6268.5,"d":"6,269 $"}},{"$f":"donnees!G58","v":{"v":2342.2300000000005,"d":"2,342 $"}}]
[57,"Moselle",{"$f":"SUMIF(donnees!$B$2:$B$420,$B59,donnees!$F$2:$F$420)","v":{"v":11475.42,"d":"11,475.42 $"}},{"$f":"SUMIF(donnees!$B$2:$B$420,$B59,donnees!$G$2:$G$420)","v":{"v":17876.190000000002,"d":"17,876.19 $"}},"classe3",1.557780891679782,57,"Moselle (57)",{"$nulls":7},"Calvados59","Calvados","Lait",{"$f":"donnees!E59","v":{"v":4671,"d":"4,671 $"}},{"$f":"donnees!G59","v":{"v":3213,"d":"3,213 $"}}]
[58,"Nièvre",{"$f":"SUMIF(donnees!$B$2:$B$420,$B60,donnees!$F$2:$F$420)","v":{"v":23146.91,"d":"23,146.91 $"}},{"$f":"SUMIF(donnees!$B$2:$B$420,$B60,donnees!$G$2:$G$420)","v":{"v":11754.78,"d":"11,754.78 $"}},"classe0",0.507833659006753,58,"Nièvre (58)",{"$nulls":7},"Calvados60","Calvados","Fromage",{"$f":"donnees!E60","v":{"v":3740.0000000000005,"d":"3,740 $"}},{"$f":"donnees!G60","v":{"v":2354,"d":"2,354 $"}}]
[59,"Nord",{"$f":"SUMIF(donnees!$B$2:$B$420,$B61,donnees!$F$2:$F$420)","v":{"v":17502.96,"d":"17,502.96 $"}},{"$f":"SUMIF(donnees!$B$2:$B$420,$B61,donnees!$G$2:$G$420)","v":{"v":20274.210000000003,"d":"20,274.21 $"}},"classe3",1.158330362407273,59,"Nord (59)",{"$nulls":7},"Calvados61","Calvados","Riz",{"$f":"donnees!E61","v":{"v":4101,"d":"4,101 $"}},{"$f":"donnees!G61","v":{"v":7788,"d":"7,788 $"}}]
[60,"Oise",{"$f":"SUMIF(donnees!$B$2:$B$420,$B62,donnees!$F$2:$F$420)","v":{"v":17182.6,"d":"17,182.60 $"}},{"$f":"SUMIF(donnees!$B$2:$B$420,$B62,donnees!$G$2:$G$420)","v":{"v":15924.3,"d":"15,924.30 $"}},"classe2",0.9267689406725409,60,"Oise (60)",{"$nulls":7},"Calvados62","Calvados","Yaourt",{"$f":"donnees!E62","v":{"v":708,"d":"708 $"}},{"$f":"donnees!G62","v":{"v":3063,"d":"3,063 $"}}]
[61,"Orne",{"$f":"SUMIF(donnees!$B$2:$B$420,$B63,donnees!$F$2:$F$420)","v":{"v":32113.08,"d":"32,113.08 $"}},{"$f":"SUMIF(donnees!$B$2:$B$420,$B63,donnees!$G$2:$G$420)","v":{"v":21742.2,"d":"21,742.20 $"}},"classe0",0.67705122025044,61,"Orne (61)",{"$nulls":7},"Cantal63","Cantal","Riz",{"$f":"donnees!E63","v":{"v":5970,"d":"5,970 $"}},{"$f":"donnees!G63","v":{"v":2739,"d":"2,739 $"}}]
[62,"Pas-de-Calais",{"$f":"SUMIF(donnees!$B$2:$B$420,$B64,donnees!$F$2:$F$420)","v":{"v":8662.210000000001,"d":"8,662.21 $"}},{"$f":"SUMIF(donnees!$B$2:$B$420,$B64,donnees!$G$2:$G$420)","v":{"v":14471.34,"d":"14,471.34 $"}},"classe3",1.6706290888814745,62,"Pas-de-Calais (62)",{"$nulls":7},"Cantal64","Cantal","Fromage",{"$f":"donnees!E64","v":{"v":3308.8,"d":"3,309 $"}},{"$f":"donnees!G64","v":{"v":4408.8,"d":"4,409 $"}}]
[63,"Puy-de-Dôme",{"$f":"SUMIF(donnees!$B$2:$B$420,$B65,donnees!$F$2:$F$420)","v":{"v":13484.720000000001,"d":"13,484.72 $"}},{"$f":"SUMIF(donnees!$B$2:$B$420,$B65,donnees!$G$2:$G$420)","v":{"v":11949.320000000002,"d":"11,949.32 $"}},"classe2",0.8861377915151372,63,"Puy-de-Dôme (63)",{"$nulls":7},"Cantal65","Cantal","Yaourt",{"$f":"donnees!E65","v":{"v":4020,"d":"4,020 $"}},{"$f":"donnees!G65","v":{"v":1248,"d":"1,248 $"}}]
[64,"Pyrénées-Atlantiques",{"$f":"SUMIF(donnees!$B$2:$B$420,$B66,donnees!$F$2:$F$420)","v":{"v":13856.85,"d":"13,856.85 $"}},{"$f":"SUMIF(donnees!$B$2:$B$420,$B66,donnees!$G$2:$G$420)","v":{"v":21279.480000000003,"d":"21,279.48 $"}},{"$f":"VLOOKUP(D66/C66,classeReg,4,1)","v":"classe3"},1.5356650320960394,64,"Pyrénées-Atlantiques (64)",{"$nulls":7},"Cantal66","Cantal","Lait",{"$f":"donnees!E66","v":{"v":4449,"d":"4,449 $"}},{"$f":"donnees!G66","v":{"v":4224,"d":"4,224 $"}}]
[65,"Hautes-Pyrénées",{"$f":"SUMIF(donnees!$B$2:$B$420,$B67,donnees!$F$2:$F$420)","v":{"v":34542.520000000004,"d":"34,542.52 $"}},{"$f":"SUMIF(donnees!$B$2:$B$420,$B67,donnees!$G$2:$G$420)","v":{"v":24474.48,"d":"24,474.48 $"}},"classe0",{"$f":"D67/C67","v":0.7085319774006065},65,{"$f":"B67&\" (\"&G67&\")\"","v":"Hautes-Pyrénées (65)"},{"$nulls":7},"Charente67","Charente","Sucre",{"$f":"donnees!E67","v":{"v":284.57000000000005,"d":"285 $"}},{"$f":"donnees!G67","v":{"v":3667.5700000000006,"d":"3,668 $"}}]
[66,"Pyrénées-Orientales",{"$f":"SUMIF(donnees!$B$2:$B$420,$B68,donnees!$F$2:$F$420)","v":{"v":14905.7,"d":"14,905.70 $"}},{"$f":"SUMIF(donnees!$B$2:$B$420,$B68,donnees!$G$2:$G$420)","v":{"v":20256.81,"d":"20,256.81 $"}},"classe3",1.3589975646900179,66,"Pyrénées-Orientales (66)",{"$nulls":7},"Charente68","Charente","Fromage",{"$f":"donnees!E68","v":{"v":517,"d":"517 $"}},{"$f":"donnees!G68","v":{"v":2415.6000000000004,"d":"2,416 $"}}]
[67,"Bas-Rhin",{"$f":"SUMIF(donnees!$B$2:$B$420,$B69,donnees!$F$2:$F$420)","v":{"v":17640.120000000003,"d":"17,640.12 $"}},{"$f":"SUMIF(donnees!$B$2:$B$420,$B69,donnees!$G$2:$G$420)","v":{"v":20335.520000000004,"d":"20,335.52 $"}},"classe3",1.152799414062943,67,"Bas-Rhin (67)",{"$nulls":7},"Charente69","Charente","Yaourt",{"$f":"donnees!E69","v":{"v":556.5,"d":"557 $"}},{"$f":"donnees!G69","v":{"v":2812.5,"d":"2,813 $"}}]
[68,"Haut-Rhin",{"$f":"SUMIF(donnees!$B$2:$B$420,$B70,donnees!$F$2:$F$420)","v":{"v":22290.08,"d":"22,290.08 $"}},{"$f":"SUMIF(donnees!$B$2:$B$420,$B70,donnees!$G$2:$G$420)","v":{"v":19105.42,"d":"19,105.42 $"}},"classe2",0.8571265782805624,68,"Haut-Rhin (68)",{"$nulls":7},"Charente70","Charente","Riz",{"$f":"donnees!E70","v":{"v":7023,"d":"7,023 $"}},{"$f":"donnees!G70","v":{"v":7179,"d":"7,179 $"}}]
[69,"Rhône",{"$f":"SUMIF(donnees!$B$2:$B$420,$B71,donnees!$F$2:$F$420)","v":{"v":9299.67,"d":"9,299.67 $"}},{"$f":"SUMIF(donnees!$B$2:$B$420,$B71,donnees!$G$2:$G$420)","v":{"v":16171.37,"d":"16,171.37 $"}},"classe3",1.7389186928138312,69,"Rhône (69)",{"$nulls":7},"Charente71","Charente","Lait",{"$f":"donnees!E71","v":{"v":7557,"d":"7,557 $"}},{"$f":"donnees!G71","v":{"v":2841,"d":"2,841 $"}}]
[70,"Haute-Saône",{"$f":"SUMIF(donnees!$B$2:$B$420,$B72,donnees!$F$2:$F$420)","v":{"v":19725.25,"d":"19,725.25 $"}},{"$f":"SUMIF(donnees!$B$2:$B$420,$B72,donnees!$G$2:$G$420)","v":{"v":10298.36,"d":"10,298.36 $"}},"classe0",0.5220902143192102,70,"Haute-Saône (70)",{"$nulls":7},"Charente-Maritime72","Charente-Maritime","Yaourt",{"$f":"donnees!E72","v":{"v":940.5,"d":"941 $"}},{"$f":"donnees!G72","v":{"v":3600,"d":"3,600 $"}}]
[71,"Saône-et-Loire",{"$f":"SUMIF(donnees!$B$2:$B$420,$B73,donnees!$F$2:$F$420)","v":{"v":14203.380000000001,"d":"14,203.38 $"}},{"$f":"SUMIF(donnees!$B$2:$B$420,$B73,donnees!$G$2:$G$420)","v":{"v":18375.340000000004,"d":"18,375.34 $"}},"classe3",1.2937300839659294,71,"Saône-et-Loire (71)",{"$nulls":7},{"$f":"Q73&ROW()","v":"Charente-Maritime73"},"Charente-Maritime","Riz",{"$f":"donnees!E73","v":{"v":6153,"d":"6,153 $"}},{"$f":"donnees!G73","v":{"v":3078,"d":"3,078 $"}}]
[72,"Sarthe",{"$f":"SUMIF(donnees!$B$2:$B$420,$B74,donnees!$F$2:$F$420)","v":{"v":23064.420000000002,"d":"23,064.42 $"}},{"$f":"SUMIF(donnees!$B$2:$B$420,$B74,donnees!$G$2:$G$420)","v":{"v":23175.64,"d":"23,175.64 $"}},"classe2",1.0048221459720208,72,"Sarthe (72)",{"$nulls":7},"Charente-Maritime74","Charente-Maritime","Fromage",{"$f":"donnees!E74","v":{"v":6769.400000000001,"d":"6,769 $"}},{"$f":"donnees!G74","v":{"v":3773.0000000000005,"d":"3,773 $"}}]
[73,"Savoie",{"$f":"SUMIF(donnees!$B$2:$B$420,$B75,donnees!$F$2:$F$420)","v":{"v":12985,"d":"12,985.00 $"}},{"$f":"SUMIF(donnees!$B$2:$B$420,$B75,donnees!$G$2:$G$420)","v":{"v":21807.6,"d":"21,807.60 $"}},"classe3",1.6794455140546785,73,"Savoie (73)",{"$nulls":7},"Charente-Maritime75","Charente-Maritime","Lait",{"$f":"donnees!E75","v":{"v":11409,"d":"11,409 $"}},{"$f":"donnees!G75","v":{"v":3192,"d":"3,192 $"}}]
[74,"Haute-Savoie",{"$f":"SUMIF(donnees!$B$2:$B$420,$B76,donnees!$F$2:$F$420)","v":{"v":29818.03,"d":"29,818.03 $"}},{"$f":"SUMIF(donnees!$B$2:$B$420,$B76,donnees!$G$2:$G$420)","v":{"v":18258.46,"d":"18,258.46 $"}},"classe0",0.6123295200923736,74,"Haute-Savoie (74)",{"$nulls":7},"Charente-Maritime76","Charente-Maritime","Sucre",{"$f":"donnees!E76","v":{"v":4670.530000000001,"d":"4,671 $"}},{"$f":"donnees!G76","v":{"v":1976.0700000000002,"d":"1,976 $"}}]
[75,"Paris",{"$f":"SUMIF(donnees!$B$2:$B$420,$B77,donnees!$F$2:$F$420)","v":{"v":13934.470000000001,"d":"13,934.47 $"}},{"$f":"SUMIF(donnees!$B$2:$B$420,$B77,donnees!$G$2:$G$420)","v":{"v":14344.560000000001,"d":"14,344.56 $"}},"classe3",1.029429895790798,75,"Paris (75)",{"$nulls":7},"Cher77","Cher","Lait",{"$f":"donnees!E77","v":{"v":6648,"d":"6,648 $"}},{"$f":"donnees!G77","v":{"v":3543,"d":"3,543 $"}}]
[76,"Seine-Maritime",{"$f":"SUMIF(donnees!$B$2:$B$420,$B78,donnees!$F$2:$F$420)","v":{"v":20003.53,"d":"20,003.53 $"}},{"$f":"SUMIF(donnees!$B$2:$B$420,$B78,donnees!$G$2:$G$420)","v":{"v":14443.52,"d":"14,443.52 $"}},"classe0",0.7220485584294373,76,"Seine-Maritime (76)",{"$nulls":7},"Cher78","Cher","Fromage",{"$f":"donnees!E78","v":{"v":8331.400000000001,"d":"8,331 $"}},{"$f":"donnees!G78","v":{"v":3262.6000000000004,"d":"3,263 $"}}]
[77,"Seine-et-Marne",{"$f":"SUMIF(donnees!$B$2:$B$420,$B79,donnees!$F$2:$F$420)","v":{"v":19480.18,"d":"19,480.18 $"}},{"$f":"SUMIF(donnees!$B$2:$B$420,$B79,donnees!$G$2:$G$420)","v":{"v":8376.92,"d":"8,376.92 $"}},"classe0",0.4300227205292764,77,"Seine-et-Marne (77)",{"$nulls":7},"Cher79","Cher","Sucre",{"$f":"donnees!E79","v":{"v":4415.810000000001,"d":"4,416 $"}},{"$f":"donnees!G79","v":{"v":5187.93,"d":"5,188 $"}}]
[78,"Yvelines",{"$f":"SUMIF(donnees!$B$2:$B$420,$B80,donnees!$F$2:$F$420)","v":{"v":26011.239999999998,"d":"26,011.24 $"}},{"$f":"SUMIF(donnees!$B$2:$B$420,$B80,donnees!$G$2:$G$420)","v":{"v":18655.37,"d":"18,655.37 $"}},"classe0",0.7172041778861754,78,"Yvelines (78)",{"$nulls":7},"Cher80","Cher","Riz",{"$f":"donnees!E80","v":{"v":633,"d":"633 $"}},{"$f":"donnees!G80","v":{"v":6555,"d":"6,555 $"}}]
[79,"Deux-Sèvres",{"$f":"SUMIF(donnees!$B$2:$B$420,$B81,donnees!$F$2:$F$420)","v":{"v":28833.56,"d":"28,833.56 $"}},{"$f":"SUMIF(donnees!$B$2:$B$420,$B81,donnees!$G$2:$G$420)","v":{"v":19592.739999999998,"d":"19,592.74 $"}},"classe0",0.6795116523939464,79,"Deux-Sèvres (79)",{"$nulls":7},"Corrèze81","Corrèze","Sucre",{"$f":"donnees!E81","v":{"v":2210.8900000000003,"d":"2,211 $"}},{"$f":"donnees!G81","v":{"v":5078.480000000001,"d":"5,078 $"}}]
[80,"Somme",{"$f":"SUMIF(donnees!$B$2:$B$420,$B82,donnees!$F$2:$F$420)","v":{"v":18406.14,"d":"18,406.14 $"}},{"$f":"SUMIF(donnees!$B$2:$B$420,$B82,donnees!$G$2:$G$420)","v":{"v":22674.81,"d":"22,674.81 $"}},"classe3",1.2319155455733795,80,"Somme (80)",{"$nulls":7},"Corrèze82","Corrèze","Lait",{"$f":"donnees!E82","v":{"v":8031,"d":"8,031 $"}},{"$f":"donnees!G82","v":{"v":5856,"d":"5,856 $"}}]
[81,"Tarn",{"$f":"SUMIF(donnees!$B$2:$B$420,$B83,donnees!$F$2:$F$420)","v":{"v":19646.640000000003,"d":"19,646.64 $"}},{"$f":"SUMIF(donnees!$B$2:$B$420,$B83,donnees!$G$2:$G$420)","v":{"v":16492.73,"d":"16,492.73 $"}},"classe1",0.8394682245920929,81,"Tarn (81)",{"$nulls":7},"Corrèze83","Corrèze","Fromage",{"$f":"donnees!E83","v":{"v":7774.8,"d":"7,775 $"}},{"$f":"donnees!G83","v":{"v":4930.200000000001,"d":"4,930 $"}}]
[82,"Tarn-et-Garonne",{"$f":"SUMIF(donnees!$B$2:$B$420,$B84,donnees!$F$2:$F$420)","v":{"v":27072.06,"d":"27,072.06 $"}},{"$f":"SUMIF(donnees!$B$2:$B$420,$B84,donnees!$G$2:$G$420)","v":{"v":16185.560000000001,"d":"16,185.56 $"}},"classe0",0.5978695378186958,82,"Tarn-et-Garonne (82)",{"$nulls":7},"Corrèze84","Corrèze","Yaourt",{"$f":"donnees!E84","v":{"v":1614,"d":"1,614 $"}},{"$f":"donnees!G84","v":{"v":1485,"d":"1,485 $"}}]
[83,"Var",{"$f":"SUMIF(donnees!$B$2:$B$420,$B85,donnees!$F$2:$F$420)","v":{"v":11676.1,"d":"11,676.10 $"}},{"$f":"SUMIF(donnees!$B$2:$B$420,$B85,donnees!$G$2:$G$420)","v":{"v":13753.8,"d":"13,753.80 $"}},"classe3",1.1779446904360187,83,"Var (83)",{"$nulls":7},"Corse-du-Sud85","Corse-du-Sud","Fromage",{"$f":"donnees!E85","v":{"v":3619.0000000000005,"d":"3,619 $"}},{"$f":"donnees!G85","v":{"v":2644.4,"d":"2,644 $"}}]
[84,"Vaucluse",{"$f":"SUMIF(donnees!$B$2:$B$420,$B86,donnees!$F$2:$F$420)","v":{"v":17781.120000000003,"d":"17,781.12 $"}},{"$f":"SUMIF(donnees!$B$2:$B$420,$B86,donnees!$G$2:$G$420)","v":{"v":25462.31,"d":"25,462.31 $"}},"classe3",1.4319857241838534,84,"Vaucluse (84)",{"$nulls":7},"Corse-du-Sud86","Corse-du-Sud","Riz",{"$f":"donnees!E86","v":{"v":924,"d":"924 $"}},{"$f":"donnees!G86","v":{"v":3213,"d":"3,213 $"}}]
[85,"Vendée",{"$f":"SUMIF(donnees!$B$2:$B$420,$B87,donnees!$F$2:$F$420)","v":{"v":33276.850000000006,"d":"33,276.85 $"}},{"$f":"SUMIF(donnees!$B$2:$B$420,$B87,donnees!$G$2:$G$420)","v":{"v":15129.29,"d":"15,129.29 $"}},"classe0",0.45464910290487226,85,"Vendée (85)",{"$nulls":7},"Corse-du-Sud87","Corse-du-Sud","Sucre",{"$f":"donnees!E87","v":{"v":2638.7400000000007,"d":"2,639 $"}},{"$f":"donnees!G87","v":{"v":1603.94,"d":"1,604 $"}}]
[86,"Vienne",{"$f":"SUMIF(donnees!$B$2:$B$420,$B88,donnees!$F$2:$F$420)","v":{"v":18699.19,"d":"18,699.19 $"}},{"$f":"SUMIF(donnees!$B$2:$B$420,$B88,donnees!$G$2:$G$420)","v":{"v":23467.33,"d":"23,467.33 $"}},"classe3",1.25499179376219,86,"Vienne (86)",{"$nulls":7},"Corse-du-Sud88","Corse-du-Sud","Yaourt",{"$f":"donnees!E88","v":{"v":2572.5,"d":"2,573 $"}},{"$f":"donnees!G88","v":{"v":1261.5,"d":"1,262 $"}}]
[87,"Haute-Vienne",{"$f":"SUMIF(donnees!$B$2:$B$420,$B89,donnees!$F$2:$F$420)","v":{"v":31901.890000000003,"d":"31,901.89 $"}},{"$f":"SUMIF(donnees!$B$2:$B$420,$B89,donnees!$G$2:$G$420)","v":{"v":18934.81,"d":"18,934.81 $"}},"classe0",0.593532546190837,87,"Haute-Vienne (87)",{"$nulls":7},"Côte-d'Or89","Côte-d'Or","Riz",{"$f":"donnees!E89","v":{"v":8244,"d":"8,244 $"}},{"$f":"donnees!G89","v":{"v":4188,"d":"4,188 $"}}]
[88,"Vosges",{"$f":"SUMIF(donnees!$B$2:$B$420,$B90,donnees!$F$2:$F$420)","v":{"v":13168.5,"d":"13,168.50 $"}},{"$f":"SUMIF(donnees!$B$2:$B$420,$B90,donnees!$G$2:$G$420)","v":{"v":14706,"d":"14,706.00 $"}},"classe3",1.1167558947488325,88,"Vosges (88)",{"$nulls":7},"Côte-d'Or90","Côte-d'Or","Lait",{"$f":"donnees!E90","v":{"v":6696,"d":"6,696 $"}},{"$f":"donnees!G90","v":{"v":4113,"d":"4,113 $"}}]
[89,"Yonne",{"$f":"SUMIF(donnees!$B$2:$B$420,$B91,donnees!$F$2:$F$420)","v":{"v":9461.39,"d":"9,461.39 $"}},{"$f":"SUMIF(donnees!$B$2:$B$420,$B91,donnees!$G$2:$G$420)","v":{"v":15352.84,"d":"15,352.84 $"}},"classe3",1.62268334779562,89,"Yonne (89)",{"$nulls":7},"Côte-d'Or91","Côte-d'Or","Yaourt",{"$f":"donnees!E91","v":{"v":2052,"d":"2,052 $"}},{"$f":"donnees!G91","v":{"v":3249,"d":"3,249 $"}}]
[90,"Territoire de Belfort",{"$f":"SUMIF(donnees!$B$2:$B$420,$B92,donnees!$F$2:$F$420)","v":{"v":19817.81,"d":"19,817.81 $"}},{"$f":"SUMIF(donnees!$B$2:$B$420,$B92,donnees!$G$2:$G$420)","v":{"v":14946.67,"d":"14,946.67 $"}},"classe1",0.7542039206148409,90,"Territoire de Belfort (90)",{"$nulls":7},"Côte-d'Or92","Côte-d'Or","Fromage",{"$f":"donnees!E92","v":{"v":1361.8000000000002,"d":"1,362 $"}},{"$f":"donnees!G92","v":{"v":2435.4,"d":"2,435 $"}}]
[91,"Essonne",{"$f":"SUMIF(donnees!$B$2:$B$420,$B93,donnees!$F$2:$F$420)","v":{"v":18496.5,"d":"18,496.50 $"}},{"$f":"SUMIF(donnees!$B$2:$B$420,$B93,donnees!$G$2:$G$420)","v":{"v":10548,"d":"10,548.00 $"}},"classe0",0.5702700510907469,91,"Essonne (91)",{"$nulls":7},"Côte-d'Or93","Côte-d'Or","Sucre",{"$f":"donnees!E93","v":{"v":6771.970000000001,"d":"6,772 $"}},{"$f":"donnees!G93","v":{"v":2622.8200000000006,"d":"2,623 $"}}]
[92,"Hauts-de-Seine",{"$f":"SUMIF(donnees!$B$2:$B$420,$B94,donnees!$F$2:$F$420)","v":{"v":23073.760000000002,"d":"23,073.76 $"}},{"$f":"SUMIF(donnees!$B$2:$B$420,$B94,donnees!$G$2:$G$420)","v":{"v":16981.22,"d":"16,981.22 $"}},"classe0",0.7359537413928202,92,"Hauts-de-Seine (92)",{"$nulls":7},"Côtes-d'Armor94","Côtes-d'Armor","Sucre",{"$f":"donnees!E94","v":{"v":3460.6100000000006,"d":"3,461 $"}},{"$f":"donnees!G94","v":{"v":3229.7700000000004,"d":"3,230 $"}}]
[93,"Seine-Saint-Denis",{"$f":"SUMIF(donnees!$B$2:$B$420,$B95,donnees!$F$2:$F$420)","v":{"v":23542.3,"d":"23,542.30 $"}},{"$f":"SUMIF(donnees!$B$2:$B$420,$B95,donnees!$G$2:$G$420)","v":{"v":19510.9,"d":"19,510.90 $"}},"classe1",0.8287592970950163,93,"Seine-Saint-Denis (93)",{"$nulls":7},"Côtes-d'Armor95","Côtes-d'Armor","Yaourt",{"$f":"donnees!E95","v":{"v":1257,"d":"1,257 $"}},{"$f":"donnees!G95","v":{"v":1648.5,"d":"1,649 $"}}]
[94,"Val-de-Marne",{"$f":"SUMIF(donnees!$B$2:$B$420,$B96,donnees!$F$2:$F$420)","v":{"v":11540.130000000001,"d":"11,540.13 $"}},{"$f":"SUMIF(donnees!$B$2:$B$420,$B96,donnees!$G$2:$G$420)","v":{"v":19213.07,"d":"19,213.07 $"}},"classe3",1.6648919899515862,94,"Val-de-Marne (94)",{"$nulls":7},"Côtes-d'Armor96","Côtes-d'Armor","Fromage",{"$f":"donnees!E96","v":{"v":3341.8,"d":"3,342 $"}},{"$f":"donnees!G96","v":{"v":2987.6000000000004,"d":"2,988 $"}}]
[95,"Val-d'Oise",{"$f":"SUMIF(donnees!$B$2:$B$420,$B97,donnees!$F$2:$F$420)","v":{"v":15626.71,"d":"15,626.71 $"}},{"$f":"SUMIF(donnees!$B$2:$B$420,$B97,donnees!$G$2:$G$420)","v":{"v":16963.38,"d":"16,963.38 $"}},"classe3",1.0855375187739456,95,"Val-d'Oise (95)",{"$nulls":7},"Creuse97","Creuse","Sucre",{"$f":"donnees!E97","v":{"v":3880.5,"d":"3,881 $"}},{"$f":"donnees!G97","v":{"v":4041.6900000000005,"d":"4,042 $"}}]
[{"$nulls":15},"Creuse98","Creuse","Fromage",{"$f":"donnees!E98","v":{"v":607.2,"d":"607 $"}},{"$f":"donnees!G98","v":{"v":2156,"d":"2,156 $"}}]
[{"$nulls":15},"Creuse99","Creuse","Lait",{"$f":"donnees!E99","v":{"v":5838,"d":"5,838 $"}},{"$f":"donnees!G99","v":{"v":5253,"d":"5,253 $"}}]
[{"$nulls":15},"Creuse100","Creuse","Riz",{"$f":"donnees!E100","v":{"v":5529,"d":"5,529 $"}},{"$f":"donnees!G100","v":{"v":3996,"d":"3,996 $"}}]
[{"$nulls":15},"Creuse101","Creuse","Yaourt",{"$f":"donnees!E101","v":{"v":2973,"d":"2,973 $"}},{"$f":"donnees!G101","v":{"v":2361,"d":"2,361 $"}}]
[{"$nulls":15},"Deux-Sèvres102","Deux-Sèvres","Lait",{"$f":"donnees!E102","v":{"v":6357,"d":"6,357 $"}},{"$f":"donnees!G102","v":{"v":5688,"d":"5,688 $"}}]
[{"$nulls":15},"Deux-Sèvres103","Deux-Sèvres","Fromage",{"$f":"donnees!E103","v":{"v":1753.4,"d":"1,753 $"}},{"$f":"donnees!G103","v":{"v":3957.8,"d":"3,958 $"}}]
[{"$nulls":15},"Deux-Sèvres104","Deux-Sèvres","Yaourt",{"$f":"donnees!E104","v":{"v":3075,"d":"3,075 $"}},{"$f":"donnees!G104","v":{"v":3609,"d":"3,609 $"}}]
[{"$nulls":15},"Deux-Sèvres105","Deux-Sèvres","Riz",{"$f":"donnees!E105","v":{"v":6936,"d":"6,936 $"}},{"$f":"donnees!G105","v":{"v":3540,"d":"3,540 $"}}]
[{"$nulls":15},"Deux-Sèvres106","Deux-Sèvres","Sucre",{"$f":"donnees!E106","v":{"v":5910.300000000001,"d":"5,910 $"}},{"$f":"donnees!G106","v":{"v":2797.9400000000005,"d":"2,798 $"}}]
[{"$nulls":15},"Dordogne107","Dordogne","Sucre",{"$f":"donnees!E107","v":{"v":2863.6100000000006,"d":"2,864 $"}},{"$f":"donnees!G107","v":{"v":4352.130000000001,"d":"4,352 $"}}]
[{"$nulls":15},"Dordogne108","Dordogne","Riz",{"$f":"donnees!E108","v":{"v":3114,"d":"3,114 $"}},{"$f":"donnees!G108","v":{"v":6852,"d":"6,852 $"}}]
[{"$nulls":15},"Dordogne109","Dordogne","Lait",{"$f":"donnees!E109","v":{"v":1497,"d":"1,497 $"}},{"$f":"donnees!G109","v":{"v":3012,"d":"3,012 $"}}]
[{"$nulls":15},"Dordogne110","Dordogne","Yaourt",{"$f":"donnees!E110","v":{"v":1417.5,"d":"1,418 $"}},{"$f":"donnees!G110","v":{"v":2823,"d":"2,823 $"}}]
[{"$nulls":15},"Doubs111","Doubs","Lait",{"$f":"donnees!E111","v":{"v":3114,"d":"3,114 $"}},{"$f":"donnees!G111","v":{"v":7287,"d":"7,287 $"}}]
[{"$nulls":15},"Doubs112","Doubs","Sucre",{"$f":"donnees!E112","v":{"v":3026.79,"d":"3,027 $"}},{"$f":"donnees!G112","v":{"v":2652.67,"d":"2,653 $"}}]
[{"$nulls":15},"Doubs113","Doubs","Riz",{"$f":"donnees!E113","v":{"v":3927,"d":"3,927 $"}},{"$f":"donnees!G113","v":{"v":2730,"d":"2,730 $"}}]
[{"$nulls":15},"Drôme114","Drôme","Yaourt",{"$f":"donnees!E114","v":{"v":1228.5,"d":"1,229 $"}},{"$f":"donnees!G114","v":{"v":1338,"d":"1,338 $"}}]
[{"$nulls":15},"Drôme115","Drôme","Fromage",{"$f":"donnees!E115","v":{"v":3176.8,"d":"3,177 $"}},{"$f":"donnees!G115","v":{"v":3691.6000000000004,"d":"3,692 $"}}]
[{"$nulls":15},"Drôme116","Drôme","Sucre",{"$f":"donnees!E116","v":{"v":384.07000000000005,"d":"384 $"}},{"$f":"donnees!G116","v":{"v":5124.25,"d":"5,124 $"}}]
[{"$nulls":15},"Drôme117","Drôme","Lait",{"$f":"donnees!E117","v":{"v":3837,"d":"3,837 $"}},{"$f":"donnees!G117","v":{"v":7413,"d":"7,413 $"}}]
[{"$nulls":15},"Drôme118","Drôme","Riz",{"$f":"donnees!E118","v":{"v":402,"d":"402 $"}},{"$f":"donnees!G118","v":{"v":5478,"d":"5,478 $"}}]
[{"$nulls":15},"Essonne119","Essonne","Lait",{"$f":"donnees!E119","v":{"v":5319,"d":"5,319 $"}},{"$f":"donnees!G119","v":{"v":5055,"d":"5,055 $"}}]
[{"$nulls":15},"Essonne120","Essonne","Yaourt",{"$f":"donnees!E120","v":{"v":2889,"d":"2,889 $"}},{"$f":"donnees!G120","v":{"v":2397,"d":"2,397 $"}}]
[{"$nulls":15},"Essonne121","Essonne","Riz",{"$f":"donnees!E121","v":{"v":7209,"d":"7,209 $"}},{"$f":"donnees!G121","v":{"v":3096,"d":"3,096 $"}}]
[{"$nulls":15},"Eure122","Eure","Fromage",{"$f":"donnees!E122","v":{"v":3773.0000000000005,"d":"3,773 $"}},{"$f":"donnees!G122","v":{"v":2341,"d":"2,341 $"}}]
[{"$nulls":15},"Eure123","Eure","Yaourt",{"$f":"donnees!E123","v":{"v":3036,"d":"3,036 $"}},{"$f":"donnees!G123","v":{"v":2997,"d":"2,997 $"}}]
[{"$nulls":15},"Eure124","Eure","Riz",{"$f":"donnees!E124","v":{"v":7932,"d":"7,932 $"}},{"$f":"donnees!G124","v":{"v":3651,"d":"3,651 $"}}]
[{"$nulls":15},"Eure125","Eure","Sucre",{"$f":"donnees!E125","v":{"v":4941.17,"d":"4,941 $"}},{"$f":"donnees!G125","v":{"v":4081.4900000000007,"d":"4,081 $"}}]
[{"$nulls":15},"Eure-et-Loir126","Eure-et-Loir","Riz",{"$f":"donnees!E126","v":{"v":5061,"d":"5,061 $"}},{"$f":"donnees!G126","v":{"v":4341,"d":"4,341 $"}}]
[{"$nulls":15},"Eure-et-Loir127","Eure-et-Loir","Sucre",{"$f":"donnees!E127","v":{"v":2602.92,"d":"2,603 $"}},{"$f":"donnees!G127","v":{"v":3456.63,"d":"3,457 $"}}]
[{"$nulls":15},"Eure-et-Loir128","Eure-et-Loir","Fromage",{"$f":"donnees!E128","v":{"v":7185.200000000001,"d":"7,185 $"}},{"$f":"donnees!G128","v":{"v":5407.6,"d":"5,408 $"}}]
[{"$nulls":15},"Eure-et-Loir129","Eure-et-Loir","Lait",{"$f":"donnees!E129","v":{"v":309,"d":"309 $"}},{"$f":"donnees!G129","v":{"v":3462,"d":"3,462 $"}}]
[{"$nulls":15},"Eure-et-Loir130","Eure-et-Loir","Yaourt",{"$f":"donnees!E130","v":{"v":5616,"d":"5,616 $"}},{"$f":"donnees!G130","v":{"v":3531,"d":"3,531 $"}}]
[{"$nulls":15},"Finistère131","Finistère","Yaourt",{"$f":"donnees!E131","v":{"v":411,"d":"411 $"}},{"$f":"donnees!G131","v":{"v":1653,"d":"1,653 $"}}]
[{"$nulls":15},"Finistère132","Finistère","Riz",{"$f":"donnees!E132","v":{"v":1767,"d":"1,767 $"}},{"$f":"donnees!G132","v":{"v":6369,"d":"6,369 $"}}]
[{"$nulls":15},"Finistère133","Finistère","Fromage",{"$f":"donnees!E133","v":{"v":5843.200000000001,"d":"5,843 $"}},{"$f":"donnees!G133","v":{"v":5915.8,"d":"5,916 $"}}]
[{"$nulls":15},"Finistère134","Finistère","Sucre",{"$f":"donnees!E134","v":{"v":33.83,"d":"34 $"}},{"$f":"donnees!G134","v":{"v":4656.6,"d":"4,657 $"}}]
[{"$nulls":15},"Gard135","Gard","Riz",{"$f":"donnees!E135","v":{"v":1683,"d":"1,683 $"}},{"$f":"donnees!G135","v":{"v":4593,"d":"4,593 $"}}]
[{"$nulls":15},"Gard136","Gard","Fromage",{"$f":"donnees!E136","v":{"v":3405.6000000000004,"d":"3,406 $"}},{"$f":"donnees!G136","v":{"v":4232.8,"d":"4,233 $"}}]
[{"$nulls":15},{"$f":"Q137&ROW()","v":"Gard137"},"Gard","Lait",{"$f":"donnees!E137","v":{"v":3126,"d":"3,126 $"}},{"$f":"donnees!G137","v":{"v":5793,"d":"5,793 $"}}]
[{"$nulls":15},"Gard138","Gard","Sucre",{"$f":"donnees!E138","v":{"v":7028.68,"d":"7,029 $"}},{"$f":"donnees!G138","v":{"v":3970.05,"d":"3,970 $"}}]
[{"$nulls":15},"Gard139","Gard","Yaourt",{"$f":"donnees!E139","v":{"v":1278,"d":"1,278 $"}},{"$f":"donnees!G139","v":{"v":3841.5,"d":"3,842 $"}}]
[{"$nulls":15},"Gers140","Gers","Riz",{"$f":"donnees!E140","v":{"v":5115,"d":"5,115 $"}},{"$f":"donnees!G140","v":{"v":7236,"d":"7,236 $"}}]
[{"$nulls":15},"Gers141","Gers","Sucre",{"$f":"donnees!E141","v":{"v":3989.9500000000007,"d":"3,990 $"}},{"$f":"donnees!G141","v":{"v":4401.880000000001,"d":"4,402 $"}}]
[{"$nulls":15},"Gers142","Gers","Lait",{"$f":"donnees!E142","v":{"v":7770,"d":"7,770 $"}},{"$f":"donnees!G142","v":{"v":5229,"d":"5,229 $"}}]
[{"$nulls":15},"Gers143","Gers","Fromage",{"$f":"donnees!E143","v":{"v":5852.000000000001,"d":"5,852 $"}},{"$f":"donnees!G143","v":{"v":3790.6000000000004,"d":"3,791 $"}}]
[{"$nulls":15},"Gironde144","Gironde","Sucre",{"$f":"donnees!E144","v":{"v":3452.6500000000005,"d":"3,453 $"}},{"$f":"donnees!G144","v":{"v":4911.32,"d":"4,911 $"}}]
[{"$nulls":15},"Gironde145","Gironde","Yaourt",{"$f":"donnees!E145","v":{"v":3510,"d":"3,510 $"}},{"$f":"donnees!G145","v":{"v":3889.5,"d":"3,890 $"}}]
[{"$nulls":15},"Gironde146","Gironde","Fromage",{"$f":"donnees!E146","v":{"v":4657.400000000001,"d":"4,657 $"}},{"$f":"donnees!G146","v":{"v":4067.8,"d":"4,068 $"}}]
[{"$nulls":15},"Gironde147","Gironde","Lait",{"$f":"donnees!E147","v":{"v":7311,"d":"7,311 $"}},{"$f":"donnees!G147","v":{"v":2670,"d":"2,670 $"}}]
[{"$nulls":15},"Haute-Corse148","Haute-Corse","Sucre",{"$f":"donnees!E148","v":{"v":6545.110000000001,"d":"6,545 $"}},{"$f":"donnees!G148","v":{"v":1904.4300000000003,"d":"1,904 $"}}]
[{"$nulls":15},"Haute-Corse149","Haute-Corse","Riz",{"$f":"donnees!E149","v":{"v":9600,"d":"9,600 $"}},{"$f":"donnees!G149","v":{"v":3438,"d":"3,438 $"}}]
[{"$nulls":15},"Haute-Corse150","Haute-Corse","Fromage",{"$f":"donnees!E150","v":{"v":4468.200000000001,"d":"4,468 $"}},{"$f":"donnees!G150","v":{"v":5332.8,"d":"5,333 $"}}]
[{"$nulls":15},"Haute-Corse151","Haute-Corse","Lait",{"$f":"donnees!E151","v":{"v":1995,"d":"1,995 $"}},{"$f":"donnees!G151","v":{"v":3912,"d":"3,912 $"}}]
[{"$nulls":15},"Haute-Corse152","Haute-Corse","Yaourt",{"$f":"donnees!E152","v":{"v":2023.5,"d":"2,024 $"}},{"$f":"donnees!G152","v":{"v":1453.5,"d":"1,454 $"}}]
[{"$nulls":15},"Haute-Garonne153","Haute-Garonne","Fromage",{"$f":"donnees!E153","v":{"v":616,"d":"616 $"}},{"$f":"donnees!G153","v":{"v":4389,"d":"4,389 $"}}]
[{"$nulls":15},"Haute-Garonne154","Haute-Garonne","Lait",{"$f":"donnees!E154","v":{"v":4941,"d":"4,941 $"}},{"$f":"donnees!G154","v":{"v":7503,"d":"7,503 $"}}]
[{"$nulls":15},"Haute-Garonne155","Haute-Garonne","Yaourt",{"$f":"donnees!E155","v":{"v":699,"d":"699 $"}},{"$f":"donnees!G155","v":{"v":1366.5,"d":"1,367 $"}}]
[{"$nulls":15},"Haute-Garonne156","Haute-Garonne","Riz",{"$f":"donnees!E156","v":{"v":180,"d":"180 $"}},{"$f":"donnees!G156","v":{"v":4095,"d":"4,095 $"}}]
[{"$nulls":15},"Haute-Garonne157","Haute-Garonne","Sucre",{"$f":"donnees!E157","v":{"v":2988.9800000000005,"d":"2,989 $"}},{"$f":"donnees!G157","v":{"v":2807.8900000000003,"d":"2,808 $"}}]
[{"$nulls":15},"Haute-Loire158","Haute-Loire","Lait",{"$f":"donnees!E158","v":{"v":5709,"d":"5,709 $"}},{"$f":"donnees!G158","v":{"v":6867,"d":"6,867 $"}}]
[{"$nulls":15},"Haute-Loire159","Haute-Loire","Yaourt",{"$f":"donnees!E159","v":{"v":151.5,"d":"152 $"}},{"$f":"donnees!G159","v":{"v":3091.5,"d":"3,092 $"}}]
[{"$nulls":15},"Haute-Loire160","Haute-Loire","Sucre",{"$f":"donnees!E160","v":{"v":7936.120000000001,"d":"7,936 $"}},{"$f":"donnees!G160","v":{"v":2981.0200000000004,"d":"2,981 $"}}]
[{"$nulls":15},"Haute-Loire161","Haute-Loire","Fromage",{"$f":"donnees!E161","v":{"v":1122,"d":"1,122 $"}},{"$f":"donnees!G161","v":{"v":3955.6000000000004,"d":"3,956 $"}}]
[{"$nulls":15},"Haute-Loire162","Haute-Loire","Riz",{"$f":"donnees!E162","v":{"v":4983,"d":"4,983 $"}},{"$f":"donnees!G162","v":{"v":7098,"d":"7,098 $"}}]
[{"$nulls":15},"Haute-Marne163","Haute-Marne","Fromage",{"$f":"donnees!E163","v":{"v":1969,"d":"1,969 $"}},{"$f":"donnees!G163","v":{"v":4943.400000000001,"d":"4,943 $"}}]
[{"$nulls":15},"Haute-Marne164","Haute-Marne","Yaourt",{"$f":"donnees!E164","v":{"v":1065,"d":"1,065 $"}},{"$f":"donnees!G164","v":{"v":4063.5,"d":"4,064 $"}}]
[{"$nulls":15},"Haute-Marne165","Haute-Marne","Lait",{"$f":"donnees!E165","v":{"v":660,"d":"660 $"}},{"$f":"donnees!G165","v":{"v":3150,"d":"3,150 $"}}]
[{"$nulls":15},"Haute-Marne166","Haute-Marne","Riz",{"$f":"donnees!E166","v":{"v":1584,"d":"1,584 $"}},{"$f":"donnees!G166","v":{"v":7005,"d":"7,005 $"}}]
[{"$nulls":15},"Haute-Marne167","Haute-Marne","Sucre",{"$f":"donnees!E167","v":{"v":1134.3000000000002,"d":"1,134 $"}},{"$f":"donnees!G167","v":{"v":5000.870000000001,"d":"5,001 $"}}]
[{"$nulls":15},"Hautes-Alpes168","Hautes-Alpes","Yaourt",{"$f":"donnees!E168","v":{"v":685.5,"d":"686 $"}},{"$f":"donnees!G168","v":{"v":2721,"d":"2,721 $"}}]
[{"$nulls":15},"Hautes-Alpes169","Hautes-Alpes","Lait",{"$f":"donnees!E169","v":{"v":1815,"d":"1,815 $"}},{"$f":"donnees!G169","v":{"v":6279,"d":"6,279 $"}}]
[{"$nulls":15},"Hautes-Alpes170","Hautes-Alpes","Riz",{"$f":"donnees!E170","v":{"v":5097,"d":"5,097 $"}},{"$f":"donnees!G170","v":{"v":5565,"d":"5,565 $"}}]
[{"$nulls":15},"Haute-Saône171","Haute-Saône","Lait",{"$f":"donnees!E171","v":{"v":7593,"d":"7,593 $"}},{"$f":"donnees!G171","v":{"v":2397,"d":"2,397 $"}}]
[{"$nulls":15},"Haute-Saône172","Haute-Saône","Riz",{"$f":"donnees!E172","v":{"v":5571,"d":"5,571 $"}},{"$f":"donnees!G172","v":{"v":2799,"d":"2,799 $"}}]
[{"$nulls":15},"Haute-Saône173","Haute-Saône","Sucre",{"$f":"donnees!E173","v":{"v":3275.54,"d":"3,276 $"}},{"$f":"donnees!G173","v":{"v":5102.360000000001,"d":"5,102 $"}}]
[{"$nulls":15},"Haute-Savoie174","Haute-Savoie","Yaourt",{"$f":"donnees!E174","v":{"v":2628,"d":"2,628 $"}},{"$f":"donnees!G174","v":{"v":2011.5,"d":"2,012 $"}}]
[{"$nulls":15},"Haute-Savoie175","Haute-Savoie","Lait",{"$f":"donnees!E175","v":{"v":5934,"d":"5,934 $"}},{"$f":"donnees!G175","v":{"v":4989,"d":"4,989 $"}}]
[{"$nulls":15},"Haute-Savoie176","Haute-Savoie","Riz",{"$f":"donnees!E176","v":{"v":4767,"d":"4,767 $"}},{"$f":"donnees!G176","v":{"v":4059,"d":"4,059 $"}}]
[{"$nulls":15},"Haute-Savoie177","Haute-Savoie","Fromage",{"$f":"donnees!E177","v":{"v":6355.8,"d":"6,356 $"}},{"$f":"donnees!G177","v":{"v":3410.0000000000005,"d":"3,410 $"}}]
[{"$nulls":15},"Haute-Savoie178","Haute-Savoie","Sucre",{"$f":"donnees!E178","v":{"v":5170.02,"d":"5,170 $"}},{"$f":"donnees!G178","v":{"v":3788.96,"d":"3,789 $"}}]
[{"$nulls":15},"Hautes-Pyrénées179","Hautes-Pyrénées","Fromage",{"$f":"donnees!E179","v":{"v":5781.6,"d":"5,782 $"}},{"$f":"donnees!G179","v":{"v":5093,"d":"5,093 $"}}]
[{"$nulls":15},"Hautes-Pyrénées180","Hautes-Pyrénées","Yaourt",{"$f":"donnees!E180","v":{"v":4855.5,"d":"4,856 $"}},{"$f":"donnees!G180","v":{"v":3261,"d":"3,261 $"}}]
[{"$nulls":15},"Hautes-Pyrénées181","Hautes-Pyrénées","Riz",{"$f":"donnees!E181","v":{"v":10473,"d":"10,473 $"}},{"$f":"donnees!G181","v":{"v":7884,"d":"7,884 $"}}]
[{"$nulls":15},"Hautes-Pyrénées182","Hautes-Pyrénées","Sucre",{"$f":"donnees!E182","v":{"v":6813.76,"d":"6,814 $"}},{"$f":"donnees!G182","v":{"v":2491.4800000000005,"d":"2,491 $"}}]
[{"$nulls":15},"Hautes-Pyrénées183","Hautes-Pyrénées","Lait",{"$f":"donnees!E183","v":{"v":867,"d":"867 $"}},{"$f":"donnees!G183","v":{"v":5745,"d":"5,745 $"}}]
[{"$nulls":15},"Haute-Vienne184","Haute-Vienne","Lait",{"$f":"donnees!E184","v":{"v":8676,"d":"8,676 $"}},{"$f":"donnees!G184","v":{"v":4770,"d":"4,770 $"}}]
[{"$nulls":15},"Haute-Vienne185","Haute-Vienne","Yaourt",{"$f":"donnees!E185","v":{"v":1285.5,"d":"1,286 $"}},{"$f":"donnees!G185","v":{"v":3831,"d":"3,831 $"}}]
[{"$nulls":15},"Haute-Vienne186","Haute-Vienne","Sucre",{"$f":"donnees!E186","v":{"v":4364.07,"d":"4,364 $"}},{"$f":"donnees!G186","v":{"v":4376.01,"d":"4,376 $"}}]
[{"$nulls":15},"Haute-Vienne187","Haute-Vienne","Riz",{"$f":"donnees!E187","v":{"v":8163,"d":"8,163 $"}},{"$f":"donnees!G187","v":{"v":3309,"d":"3,309 $"}}]
[{"$nulls":15},"Haute-Vienne188","Haute-Vienne","Fromage",{"$f":"donnees!E188","v":{"v":4100.8,"d":"4,101 $"}},{"$f":"donnees!G188","v":{"v":2648.8,"d":"2,649 $"}}]
[{"$nulls":15},"Haut-Rhin189","Haut-Rhin","Sucre",{"$f":"donnees!E189","v":{"v":4465.560000000001,"d":"4,466 $"}},{"$f":"donnees!G189","v":{"v":4214.82,"d":"4,215 $"}}]
[{"$nulls":15},"Haut-Rhin190","Haut-Rhin","Riz",{"$f":"donnees!E190","v":{"v":11541,"d":"11,541 $"}},{"$f":"donnees!G190","v":{"v":4542,"d":"4,542 $"}}]
[{"$nulls":15},"Haut-Rhin191","Haut-Rhin","Lait",{"$f":"donnees!E191","v":{"v":1647,"d":"1,647 $"}},{"$f":"donnees!G191","v":{"v":6723,"d":"6,723 $"}}]
[{"$nulls":15},"Haut-Rhin192","Haut-Rhin","Fromage",{"$f":"donnees!E192","v":{"v":926.2,"d":"926 $"}},{"$f":"donnees!G192","v":{"v":3625.6000000000004,"d":"3,626 $"}}]
[{"$nulls":15},"Hauts-de-Seine193","Hauts-de-Seine","Fromage",{"$f":"donnees!E193","v":{"v":1476.2,"d":"1,476 $"}},{"$f":"donnees!G193","v":{"v":1817.2,"d":"1,817 $"}}]
[{"$nulls":15},"Hauts-de-Seine194","Hauts-de-Seine","Sucre",{"$f":"donnees!E194","v":{"v":2278.55,"d":"2,279 $"}},{"$f":"donnees!G194","v":{"v":2085.5200000000004,"d":"2,086 $"}}]
[{"$nulls":15},"Hauts-de-Seine195","Hauts-de-Seine","Lait",{"$f":"donnees!E195","v":{"v":450,"d":"450 $"}},{"$f":"donnees!G195","v":{"v":2862,"d":"2,862 $"}}]
[{"$nulls":15},"Hauts-de-Seine196","Hauts-de-Seine","Riz",{"$f":"donnees!E196","v":{"v":10941,"d":"10,941 $"}},{"$f":"donnees!G196","v":{"v":7710,"d":"7,710 $"}}]
[{"$nulls":15},"Hauts-de-Seine197","Hauts-de-Seine","Yaourt",{"$f":"donnees!E197","v":{"v":4084.5,"d":"4,085 $"}},{"$f":"donnees!G197","v":{"v":2506.5,"d":"2,507 $"}}]
[{"$nulls":15},"Hérault198","Hérault","Lait",{"$f":"donnees!E198","v":{"v":10458,"d":"10,458 $"}},{"$f":"donnees!G198","v":{"v":4374,"d":"4,374 $"}}]
[{"$nulls":15},"Hérault199","Hérault","Yaourt",{"$f":"donnees!E199","v":{"v":5005.5,"d":"5,006 $"}},{"$f":"donnees!G199","v":{"v":3720,"d":"3,720 $"}}]
[{"$nulls":15},"Hérault200","Hérault","Riz",{"$f":"donnees!E200","v":{"v":3435,"d":"3,435 $"}},{"$f":"donnees!G200","v":{"v":5505,"d":"5,505 $"}}]
[{"$nulls":15},{"$f":"Q201&ROW()","v":"Hérault201"},"Hérault","Sucre",{"$f":"donnees!E201","v":{"v":4179,"d":"4,179 $"}},{"$f":"donnees!G201","v":{"v":4244.67,"d":"4,245 $"}}]
[{"$nulls":15},"Ille-et-Vilaine202","Ille-et-Vilaine","Sucre",{"$f":"donnees!E202","v":{"v":682.5700000000002,"d":"683 $"}},{"$f":"donnees!G202","v":{"v":4053.63,"d":"4,054 $"}}]
[{"$nulls":15},"Ille-et-Vilaine203","Ille-et-Vilaine","Yaourt",{"$f":"donnees!E203","v":{"v":3202.5,"d":"3,203 $"}},{"$f":"donnees!G203","v":{"v":2892,"d":"2,892 $"}}]
[{"$nulls":15},"Ille-et-Vilaine204","Ille-et-Vilaine","Riz",{"$f":"donnees!E204","v":{"v":8019,"d":"8,019 $"}},{"$f":"donnees!G204","v":{"v":4068,"d":"4,068 $"}}]
[{"$nulls":15},"Ille-et-Vilaine205","Ille-et-Vilaine","Fromage",{"$f":"donnees!E205","v":{"v":334.40000000000003,"d":"334 $"}},{"$f":"donnees!G205","v":{"v":5082,"d":"5,082 $"}}]
[{"$nulls":15},"Ille-et-Vilaine206","Ille-et-Vilaine","Lait",{"$f":"donnees!E206","v":{"v":5796,"d":"5,796 $"}},{"$f":"donnees!G206","v":{"v":4350,"d":"4,350 $"}}]
[{"$nulls":15},"Indre207","Indre","Lait",{"$f":"donnees!E207","v":{"v":558,"d":"558 $"}},{"$f":"donnees!G207","v":{"v":8019,"d":"8,019 $"}}]
[{"$nulls":15},"Indre208","Indre","Yaourt",{"$f":"donnees!E208","v":{"v":1846.5,"d":"1,847 $"}},{"$f":"donnees!G208","v":{"v":3448.5,"d":"3,449 $"}}]
[{"$nulls":15},"Indre209","Indre","Sucre",{"$f":"donnees!E209","v":{"v":5556.08,"d":"5,556 $"}},{"$f":"donnees!G209","v":{"v":5028.730000000001,"d":"5,029 $"}}]
[{"$nulls":15},"Indre210","Indre","Riz",{"$f":"donnees!E210","v":{"v":10458,"d":"10,458 $"}},{"$f":"donnees!G210","v":{"v":3666,"d":"3,666 $"}}]
[{"$nulls":15},"Indre-et-Loire211","Indre-et-Loire","Yaourt",{"$f":"donnees!E211","v":{"v":1072.5,"d":"1,073 $"}},{"$f":"donnees!G211","v":{"v":3768,"d":"3,768 $"}}]
[{"$nulls":15},"Indre-et-Loire212","Indre-et-Loire","Sucre",{"$f":"donnees!E212","v":{"v":3554.1400000000003,"d":"3,554 $"}},{"$f":"donnees!G212","v":{"v":1791,"d":"1,791 $"}}]
[{"$nulls":15},"Indre-et-Loire213","Indre-et-Loire","Fromage",{"$f":"donnees!E213","v":{"v":466.40000000000003,"d":"466 $"}},{"$f":"donnees!G213","v":{"v":5937.8,"d":"5,938 $"}}]
[{"$nulls":15},"Isère214","Isère","Sucre",{"$f":"donnees!E214","v":{"v":1922.3400000000001,"d":"1,922 $"}},{"$f":"donnees!G214","v":{"v":3259.620000000001,"d":"3,260 $"}}]
[{"$nulls":15},"Isère215","Isère","Yaourt",{"$f":"donnees!E215","v":{"v":1318.5,"d":"1,319 $"}},{"$f":"donnees!G215","v":{"v":3829.5,"d":"3,830 $"}}]
[{"$nulls":15},"Isère216","Isère","Fromage",{"$f":"donnees!E216","v":{"v":2849.0000000000005,"d":"2,849 $"}},{"$f":"donnees!G216","v":{"v":1722.6000000000001,"d":"1,723 $"}}]
[{"$nulls":15},"Isère217","Isère","Lait",{"$f":"donnees!E217","v":{"v":3285,"d":"3,285 $"}},{"$f":"donnees!G217","v":{"v":4959,"d":"4,959 $"}}]
[{"$nulls":15},"Isère218","Isère","Riz",{"$f":"donnees!E218","v":{"v":5286,"d":"5,286 $"}},{"$f":"donnees!G218","v":{"v":6354,"d":"6,354 $"}}]
[{"$nulls":15},"Jura219","Jura","Riz",{"$f":"donnees!E219","v":{"v":3642,"d":"3,642 $"}},{"$f":"donnees!G219","v":{"v":6720,"d":"6,720 $"}}]
[{"$nulls":15},"Jura220","Jura","Sucre",{"$f":"donnees!E220","v":{"v":1.9900000000000002,"d":"2 $"}},{"$f":"donnees!G220","v":{"v":2459.6400000000003,"d":"2,460 $"}}]
[{"$nulls":15},"Jura221","Jura","Lait",{"$f":"donnees!E221","v":{"v":5958,"d":"5,958 $"}},{"$f":"donnees!G221","v":{"v":5760,"d":"5,760 $"}}]
[{"$nulls":15},"Jura222","Jura","Yaourt",{"$f":"donnees!E222","v":{"v":5334,"d":"5,334 $"}},{"$f":"donnees!G222","v":{"v":3660,"d":"3,660 $"}}]
[{"$nulls":15},"Landes223","Landes","Riz",{"$f":"donnees!E223","v":{"v":909,"d":"909 $"}},{"$f":"donnees!G223","v":{"v":4899,"d":"4,899 $"}}]
[{"$nulls":15},"Landes224","Landes","Fromage",{"$f":"donnees!E224","v":{"v":2833.6000000000004,"d":"2,834 $"}},{"$f":"donnees!G224","v":{"v":4617.8,"d":"4,618 $"}}]
[{"$nulls":15},"Landes225","Landes","Sucre",{"$f":"donnees!E225","v":{"v":4523.27,"d":"4,523 $"}},{"$f":"donnees!G225","v":{"v":3474.54,"d":"3,475 $"}}]
[{"$nulls":15},"Landes226","Landes","Lait",{"$f":"donnees!E226","v":{"v":10659,"d":"10,659 $"}},{"$f":"donnees!G226","v":{"v":2784,"d":"2,784 $"}}]
[{"$nulls":15},"Landes227","Landes","Yaourt",{"$f":"donnees!E227","v":{"v":2242.5,"d":"2,243 $"}},{"$f":"donnees!G227","v":{"v":1870.5,"d":"1,871 $"}}]
[{"$nulls":15},"Loire228","Loire","Sucre",{"$f":"donnees!E228","v":{"v":2883.51,"d":"2,884 $"}},{"$f":"donnees!G228","v":{"v":4254.620000000001,"d":"4,255 $"}}]
[{"$nulls":15},"Loire229","Loire","Lait",{"$f":"donnees!E229","v":{"v":3960,"d":"3,960 $"}},{"$f":"donnees!G229","v":{"v":3987,"d":"3,987 $"}}]
[{"$nulls":15},"Loire230","Loire","Riz",{"$f":"donnees!E230","v":{"v":3339,"d":"3,339 $"}},{"$f":"donnees!G230","v":{"v":7920,"d":"7,920 $"}}]
[{"$nulls":15},"Loire231","Loire","Fromage",{"$f":"donnees!E231","v":{"v":7832.000000000001,"d":"7,832 $"}},{"$f":"donnees!G231","v":{"v":5775.000000000001,"d":"5,775 $"}}]
[{"$nulls":15},"Loire-Atlantique232","Loire-Atlantique","Riz",{"$f":"donnees!E232","v":{"v":5457,"d":"5,457 $"}},{"$f":"donnees!G232","v":{"v":5934,"d":"5,934 $"}}]
[{"$nulls":15},"Loire-Atlantique233","Loire-Atlantique","Fromage",{"$f":"donnees!E233","v":{"v":220.00000000000003,"d":"220 $"}},{"$f":"donnees!G233","v":{"v":3102.0000000000005,"d":"3,102 $"}}]
[{"$nulls":15},"Loire-Atlantique234","Loire-Atlantique","Lait",{"$f":"donnees!E234","v":{"v":525,"d":"525 $"}},{"$f":"donnees!G234","v":{"v":5418,"d":"5,418 $"}}]
[{"$nulls":15},"Loire-Atlantique235","Loire-Atlantique","Sucre",{"$f":"donnees!E235","v":{"v":304.47,"d":"304 $"}},{"$f":"donnees!G235","v":{"v":2268.6000000000004,"d":"2,269 $"}}]
[{"$nulls":15},"Loire-Atlantique236","Loire-Atlantique","Yaourt",{"$f":"donnees!E236","v":{"v":2515.5,"d":"2,516 $"}},{"$f":"donnees!G236","v":{"v":3844.5,"d":"3,845 $"}}]
[{"$nulls":15},"Loiret237","Loiret","Sucre",{"$f":"donnees!E237","v":{"v":5323.25,"d":"5,323 $"}},{"$f":"donnees!G237","v":{"v":5086.4400000000005,"d":"5,086 $"}}]
[{"$nulls":15},"Loiret238","Loiret","Lait",{"$f":"donnees!E238","v":{"v":117,"d":"117 $"}},{"$f":"donnees!G238","v":{"v":6408,"d":"6,408 $"}}]
[{"$nulls":15},"Loiret239","Loiret","Riz",{"$f":"donnees!E239","v":{"v":2097,"d":"2,097 $"}},{"$f":"donnees!G239","v":{"v":2670,"d":"2,670 $"}}]
[{"$nulls":15},"Loiret240","Loiret","Fromage",{"$f":"donnees!E240","v":{"v":5570.400000000001,"d":"5,570 $"}},{"$f":"donnees!G240","v":{"v":5612.200000000001,"d":"5,612 $"}}]
[{"$nulls":15},"Loir-et-Cher241","Loir-et-Cher","Riz",{"$f":"donnees!E241","v":{"v":10407,"d":"10,407 $"}},{"$f":"donnees!G241","v":{"v":2751,"d":"2,751 $"}}]
[{"$nulls":15},"Loir-et-Cher242","Loir-et-Cher","Sucre",{"$f":"donnees!E242","v":{"v":5830.700000000001,"d":"5,831 $"}},{"$f":"donnees!G242","v":{"v":1566.13,"d":"1,566 $"}}]
[{"$nulls":15},"Loir-et-Cher243","Loir-et-Cher","Fromage",{"$f":"donnees!E243","v":{"v":3781.8,"d":"3,782 $"}},{"$f":"donnees!G243","v":{"v":3302.2000000000003,"d":"3,302 $"}}]
[{"$nulls":15},"Loir-et-Cher244","Loir-et-Cher","Yaourt",{"$f":"donnees!E244","v":{"v":4605,"d":"4,605 $"}},{"$f":"donnees!G244","v":{"v":2611.5,"d":"2,612 $"}}]
[{"$nulls":15},"Lot245","Lot","Riz",{"$f":"donnees!E245","v":{"v":6600,"d":"6,600 $"}},{"$f":"donnees!G245","v":{"v":2994,"d":"2,994 $"}}]
[{"$nulls":15},"Lot246","Lot","Sucre",{"$f":"donnees!E246","v":{"v":1106.44,"d":"1,106 $"}},{"$f":"donnees!G246","v":{"v":4356.110000000001,"d":"4,356 $"}}]
[{"$nulls":15},"Lot247","Lot","Lait",{"$f":"donnees!E247","v":{"v":4365,"d":"4,365 $"}},{"$f":"donnees!G247","v":{"v":7320,"d":"7,320 $"}}]
[{"$nulls":15},"Lot248","Lot","Fromage",{"$f":"donnees!E248","v":{"v":3671.8,"d":"3,672 $"}},{"$f":"donnees!G248","v":{"v":2780.8,"d":"2,781 $"}}]
[{"$nulls":15},"Lot249","Lot","Yaourt",{"$f":"donnees!E249","v":{"v":3492,"d":"3,492 $"}},{"$f":"donnees!G249","v":{"v":3556.5,"d":"3,557 $"}}]
[{"$nulls":15},"Lot-et-Garonne250","Lot-et-Garonne","Yaourt",{"$f":"donnees!E250","v":{"v":2773.5,"d":"2,774 $"}},{"$f":"donnees!G250","v":{"v":2505,"d":"2,505 $"}}]
[{"$nulls":15},"Lot-et-Garonne251","Lot-et-Garonne","Fromage",{"$f":"donnees!E251","v":{"v":169.4,"d":"169 $"}},{"$f":"donnees!G251","v":{"v":3924.8,"d":"3,925 $"}}]
[{"$nulls":15},"Lot-et-Garonne252","Lot-et-Garonne","Sucre",{"$f":"donnees!E252","v":{"v":815.9000000000001,"d":"816 $"}},{"$f":"donnees!G252","v":{"v":4527.25,"d":"4,527 $"}}]
[{"$nulls":15},"Lot-et-Garonne253","Lot-et-Garonne","Riz",{"$f":"donnees!E253","v":{"v":7146,"d":"7,146 $"}},{"$f":"donnees!G253","v":{"v":3000,"d":"3,000 $"}}]
[{"$nulls":15},"Lozère254","Lozère","Lait",{"$f":"donnees!E254","v":{"v":1998,"d":"1,998 $"}},{"$f":"donnees!G254","v":{"v":6741,"d":"6,741 $"}}]
[{"$nulls":15},"Lozère255","Lozère","Fromage",{"$f":"donnees!E255","v":{"v":1302.4,"d":"1,302 $"}},{"$f":"donnees!G255","v":{"v":2659.8,"d":"2,660 $"}}]
[{"$nulls":15},"Lozère256","Lozère","Riz",{"$f":"donnees!E256","v":{"v":6381,"d":"6,381 $"}},{"$f":"donnees!G256","v":{"v":7821,"d":"7,821 $"}}]
[{"$nulls":15},"Lozère257","Lozère","Yaourt",{"$f":"donnees!E257","v":{"v":727.5,"d":"728 $"}},{"$f":"donnees!G257","v":{"v":2680.5,"d":"2,681 $"}}]
[{"$nulls":15},"Maine-et-Loire258","Maine-et-Loire","Riz",{"$f":"donnees!E258","v":{"v":8088,"d":"8,088 $"}},{"$f":"donnees!G258","v":{"v":3936,"d":"3,936 $"}}]
[{"$nulls":15},"Maine-et-Loire259","Maine-et-Loire","Yaourt",{"$f":"donnees!E259","v":{"v":4548,"d":"4,548 $"}},{"$f":"donnees!G259","v":{"v":1375.5,"d":"1,376 $"}}]
[{"$nulls":15},"Maine-et-Loire260","Maine-et-Loire","Sucre",{"$f":"donnees!E260","v":{"v":1796.9700000000003,"d":"1,797 $"}},{"$f":"donnees!G260","v":{"v":2302.4300000000003,"d":"2,302 $"}}]
[{"$nulls":15},"Maine-et-Loire261","Maine-et-Loire","Fromage",{"$f":"donnees!E261","v":{"v":1513.6000000000001,"d":"1,514 $"}},{"$f":"donnees!G261","v":{"v":5946.6,"d":"5,947 $"}}]
[{"$nulls":15},"Maine-et-Loire262","Maine-et-Loire","Lait",{"$f":"donnees!E262","v":{"v":9288,"d":"9,288 $"}},{"$f":"donnees!G262","v":{"v":3621,"d":"3,621 $"}}]
[{"$nulls":15},"Manche263","Manche","Riz",{"$f":"donnees!E263","v":{"v":447,"d":"447 $"}},{"$f":"donnees!G263","v":{"v":3393,"d":"3,393 $"}}]
[{"$nulls":15},"Manche264","Manche","Lait",{"$f":"donnees!E264","v":{"v":7566,"d":"7,566 $"}},{"$f":"donnees!G264","v":{"v":4413,"d":"4,413 $"}}]
[{"$nulls":15},{"$f":"Q265&ROW()","v":"Manche265"},"Manche","Fromage",{"$f":"donnees!E265","v":{"v":1144,"d":"1,144 $"}},{"$f":"donnees!G265","v":{"v":3344.0000000000005,"d":"3,344 $"}}]
[{"$nulls":15},"Manche266","Manche","Sucre",{"$f":"donnees!E266","v":{"v":3026.79,"d":"3,027 $"}},{"$f":"donnees!G266","v":{"v":4921.27,"d":"4,921 $"}}]
[{"$nulls":15},"Manche267","Manche","Yaourt",{"$f":"donnees!E267","v":{"v":5530.5,"d":"5,531 $"}},{"$f":"donnees!G267","v":{"v":2328,"d":"2,328 $"}}]
[{"$nulls":15},"Marne268","Marne","Fromage",{"$f":"donnees!E268","v":{"v":3368.2000000000003,"d":"3,368 $"}},{"$f":"donnees!G268","v":{"v":5313,"d":"5,313 $"}}]
[{"$nulls":15},"Marne269","Marne","Sucre",{"$f":"donnees!E269","v":{"v":923.3600000000001,"d":"923 $"}},{"$f":"donnees!G269","v":{"v":3174.05,"d":"3,174 $"}}]
[{"$nulls":15},"Marne270","Marne","Lait",{"$f":"donnees!E270","v":{"v":6135,"d":"6,135 $"}},{"$f":"donnees!G270","v":{"v":6567,"d":"6,567 $"}}]
[{"$nulls":15},"Marne271","Marne","Riz",{"$f":"donnees!E271","v":{"v":3366,"d":"3,366 $"}},{"$f":"donnees!G271","v":{"v":8106,"d":"8,106 $"}}]
[{"$nulls":15},"Mayenne272","Mayenne","Yaourt",{"$f":"donnees!E272","v":{"v":1278,"d":"1,278 $"}},{"$f":"donnees!G272","v":{"v":2965.5,"d":"2,966 $"}}]
[{"$nulls":15},"Mayenne273","Mayenne","Lait",{"$f":"donnees!E273","v":{"v":528,"d":"528 $"}},{"$f":"donnees!G273","v":{"v":6048,"d":"6,048 $"}}]
[{"$nulls":15},"Mayenne274","Mayenne","Fromage",{"$f":"donnees!E274","v":{"v":3916.0000000000005,"d":"3,916 $"}},{"$f":"donnees!G274","v":{"v":2470.6000000000004,"d":"2,471 $"}}]
[{"$nulls":15},"Mayenne275","Mayenne","Sucre",{"$f":"donnees!E275","v":{"v":232.83000000000004,"d":"233 $"}},{"$f":"donnees!G275","v":{"v":3983.9800000000005,"d":"3,984 $"}}]
[{"$nulls":15},"Mayenne276","Mayenne","Riz",{"$f":"donnees!E276","v":{"v":7863,"d":"7,863 $"}},{"$f":"donnees!G276","v":{"v":6693,"d":"6,693 $"}}]
[{"$nulls":15},"Meurthe-et-Moselle277","Meurthe-et-Moselle","Fromage",{"$f":"donnees!E277","v":{"v":7409.6,"d":"7,410 $"}},{"$f":"donnees!G277","v":{"v":2615.8,"d":"2,616 $"}}]
[{"$nulls":15},"Meurthe-et-Moselle278","Meurthe-et-Moselle","Riz",{"$f":"donnees!E278","v":{"v":8085,"d":"8,085 $"}},{"$f":"donnees!G278","v":{"v":3879,"d":"3,879 $"}}]
[{"$nulls":15},"Meurthe-et-Moselle279","Meurthe-et-Moselle","Sucre",{"$f":"donnees!E279","v":{"v":5267.530000000001,"d":"5,268 $"}},{"$f":"donnees!G279","v":{"v":2628.79,"d":"2,629 $"}}]
[{"$nulls":15},"Meurthe-et-Moselle280","Meurthe-et-Moselle","Lait",{"$f":"donnees!E280","v":{"v":5115,"d":"5,115 $"}},{"$f":"donnees!G280","v":{"v":4083,"d":"4,083 $"}}]
[{"$nulls":15},"Meurthe-et-Moselle281","Meurthe-et-Moselle","Yaourt",{"$f":"donnees!E281","v":{"v":3660,"d":"3,660 $"}},{"$f":"donnees!G281","v":{"v":1392,"d":"1,392 $"}}]
[{"$nulls":15},"Meuse282","Meuse","Riz",{"$f":"donnees!E282","v":{"v":2838,"d":"2,838 $"}},{"$f":"donnees!G282","v":{"v":6315,"d":"6,315 $"}}]
[{"$nulls":15},"Meuse283","Meuse","Sucre",{"$f":"donnees!E283","v":{"v":7920.200000000001,"d":"7,920 $"}},{"$f":"donnees!G283","v":{"v":4441.68,"d":"4,442 $"}}]
[{"$nulls":15},"Meuse284","Meuse","Lait",{"$f":"donnees!E284","v":{"v":9807,"d":"9,807 $"}},{"$f":"donnees!G284","v":{"v":4101,"d":"4,101 $"}}]
[{"$nulls":15},"Meuse285","Meuse","Fromage",{"$f":"donnees!E285","v":{"v":7961.800000000001,"d":"7,962 $"}},{"$f":"donnees!G285","v":{"v":3458.4,"d":"3,458 $"}}]
[{"$nulls":15},"Meuse286","Meuse","Yaourt",{"$f":"donnees!E286","v":{"v":678,"d":"678 $"}},{"$f":"donnees!G286","v":{"v":1744.5,"d":"1,745 $"}}]
[{"$nulls":15},"Morbihan287","Morbihan","Lait",{"$f":"donnees!E287","v":{"v":3102,"d":"3,102 $"}},{"$f":"donnees!G287","v":{"v":7041,"d":"7,041 $"}}]
[{"$nulls":15},"Morbihan288","Morbihan","Yaourt",{"$f":"donnees!E288","v":{"v":3787.5,"d":"3,788 $"}},{"$f":"donnees!G288","v":{"v":2284.5,"d":"2,285 $"}}]
[{"$nulls":15},"Morbihan289","Morbihan","Fromage",{"$f":"donnees!E289","v":{"v":4571.6,"d":"4,572 $"}},{"$f":"donnees!G289","v":{"v":4340.6,"d":"4,341 $"}}]
[{"$nulls":15},"Morbihan290","Morbihan","Sucre",{"$f":"donnees!E290","v":{"v":5239.67,"d":"5,240 $"}},{"$f":"donnees!G290","v":{"v":5303.35,"d":"5,303 $"}}]
[{"$nulls":15},"Moselle291","Moselle","Riz",{"$f":"donnees!E291","v":{"v":1272,"d":"1,272 $"}},{"$f":"donnees!G291","v":{"v":7449,"d":"7,449 $"}}]
[{"$nulls":15},"Moselle292","Moselle","Fromage",{"$f":"donnees!E292","v":{"v":2516.8,"d":"2,517 $"}},{"$f":"donnees!G292","v":{"v":4004,"d":"4,004 $"}}]
[{"$nulls":15},"Moselle293","Moselle","Yaourt",{"$f":"donnees!E293","v":{"v":142.5,"d":"143 $"}},{"$f":"donnees!G293","v":{"v":1287,"d":"1,287 $"}}]
[{"$nulls":15},"Moselle294","Moselle","Sucre",{"$f":"donnees!E294","v":{"v":5635.68,"d":"5,636 $"}},{"$f":"donnees!G294","v":{"v":5136.1900000000005,"d":"5,136 $"}}]
[{"$nulls":15},"Nièvre295","Nièvre","Sucre",{"$f":"donnees!E295","v":{"v":7892.34,"d":"7,892 $"}},{"$f":"donnees!G295","v":{"v":2571.08,"d":"2,571 $"}}]
[{"$nulls":15},"Nièvre296","Nièvre","Yaourt",{"$f":"donnees!E296","v":{"v":1939.5,"d":"1,940 $"}},{"$f":"donnees!G296","v":{"v":2044.5,"d":"2,045 $"}}]
[{"$nulls":15},"Nièvre297","Nièvre","Riz",{"$f":"donnees!E297","v":{"v":6168,"d":"6,168 $"}},{"$f":"donnees!G297","v":{"v":4596,"d":"4,596 $"}}]
[{"$nulls":15},"Nièvre298","Nièvre","Fromage",{"$f":"donnees!E298","v":{"v":3291.2000000000003,"d":"3,291 $"}},{"$f":"donnees!G298","v":{"v":2543.2000000000003,"d":"2,543 $"}}]
[{"$nulls":15},"Nord299","Nord","Sucre",{"$f":"donnees!E299","v":{"v":421.88,"d":"422 $"}},{"$f":"donnees!G299","v":{"v":2724.3100000000004,"d":"2,724 $"}}]
[{"$nulls":15},"Nord300","Nord","Riz",{"$f":"donnees!E300","v":{"v":909,"d":"909 $"}},{"$f":"donnees!G300","v":{"v":6684,"d":"6,684 $"}}]
[{"$nulls":15},"Nord301","Nord","Lait",{"$f":"donnees!E301","v":{"v":5913,"d":"5,913 $"}},{"$f":"donnees!G301","v":{"v":4878,"d":"4,878 $"}}]
[{"$nulls":15},"Nord302","Nord","Yaourt",{"$f":"donnees!E302","v":{"v":2652,"d":"2,652 $"}},{"$f":"donnees!G302","v":{"v":2254.5,"d":"2,255 $"}}]
[{"$nulls":15},"Nord303","Nord","Fromage",{"$f":"donnees!E303","v":{"v":4694.8,"d":"4,695 $"}},{"$f":"donnees!G303","v":{"v":3733.4,"d":"3,733 $"}}]
[{"$nulls":15},"Oise304","Oise","Riz",{"$f":"donnees!E304","v":{"v":8238,"d":"8,238 $"}},{"$f":"donnees!G304","v":{"v":7251,"d":"7,251 $"}}]
[{"$nulls":15},"Oise305","Oise","Fromage",{"$f":"donnees!E305","v":{"v":2197.8,"d":"2,198 $"}},{"$f":"donnees!G305","v":{"v":1966.8000000000002,"d":"1,967 $"}}]
[{"$nulls":15},"Oise306","Oise","Yaourt",{"$f":"donnees!E306","v":{"v":3285,"d":"3,285 $"}},{"$f":"donnees!G306","v":{"v":1606.5,"d":"1,607 $"}}]
[{"$nulls":15},"Oise307","Oise","Lait",{"$f":"donnees!E307","v":{"v":600,"d":"600 $"}},{"$f":"donnees!G307","v":{"v":5100,"d":"5,100 $"}}]
[{"$nulls":15},"Orne308","Orne","Yaourt",{"$f":"donnees!E308","v":{"v":456,"d":"456 $"}},{"$f":"donnees!G308","v":{"v":3882,"d":"3,882 $"}}]
[{"$nulls":15},"Orne309","Orne","Fromage",{"$f":"donnees!E309","v":{"v":2101,"d":"2,101 $"}},{"$f":"donnees!G309","v":{"v":4239.400000000001,"d":"4,239 $"}}]
[{"$nulls":15},"Orne310","Orne","Lait",{"$f":"donnees!E310","v":{"v":9669,"d":"9,669 $"}},{"$f":"donnees!G310","v":{"v":7944,"d":"7,944 $"}}]
[{"$nulls":15},"Orne311","Orne","Sucre",{"$f":"donnees!E311","v":{"v":4994.9,"d":"4,995 $"}},{"$f":"donnees!G311","v":{"v":1830.8000000000002,"d":"1,831 $"}}]
[{"$nulls":15},"Orne312","Orne","Riz",{"$f":"donnees!E312","v":{"v":9543,"d":"9,543 $"}},{"$f":"donnees!G312","v":{"v":3846,"d":"3,846 $"}}]
[{"$nulls":15},"Paris313","Paris","Sucre",{"$f":"donnees!E313","v":{"v":2841.7200000000003,"d":"2,842 $"}},{"$f":"donnees!G313","v":{"v":2992.96,"d":"2,993 $"}}]
[{"$nulls":15},"Paris314","Paris","Lait",{"$f":"donnees!E314","v":{"v":6207,"d":"6,207 $"}},{"$f":"donnees!G314","v":{"v":5064,"d":"5,064 $"}}]
[{"$nulls":15},"Paris315","Paris","Fromage",{"$f":"donnees!E315","v":{"v":1234.2,"d":"1,234 $"}},{"$f":"donnees!G315","v":{"v":2591.6000000000004,"d":"2,592 $"}}]
[{"$nulls":15},"Paris316","Paris","Yaourt",{"$f":"donnees!E316","v":{"v":1333.5,"d":"1,334 $"}},{"$f":"donnees!G316","v":{"v":3696,"d":"3,696 $"}}]
[{"$nulls":15},"Pas-de-Calais317","Pas-de-Calais","Fromage",{"$f":"donnees!E317","v":{"v":4166.8,"d":"4,167 $"}},{"$f":"donnees!G317","v":{"v":3808.2000000000003,"d":"3,808 $"}}]
[{"$nulls":15},"Pas-de-Calais318","Pas-de-Calais","Lait",{"$f":"donnees!E318","v":{"v":420,"d":"420 $"}},{"$f":"donnees!G318","v":{"v":4398,"d":"4,398 $"}}]
[{"$nulls":15},"Pas-de-Calais319","Pas-de-Calais","Riz",{"$f":"donnees!E319","v":{"v":1395,"d":"1,395 $"}},{"$f":"donnees!G319","v":{"v":2406,"d":"2,406 $"}}]
[{"$nulls":15},"Pas-de-Calais320","Pas-de-Calais","Yaourt",{"$f":"donnees!E320","v":{"v":627,"d":"627 $"}},{"$f":"donnees!G320","v":{"v":1996.5,"d":"1,997 $"}}]
[{"$nulls":15},"Pas-de-Calais321","Pas-de-Calais","Sucre",{"$f":"donnees!E321","v":{"v":612.9200000000001,"d":"613 $"}},{"$f":"donnees!G321","v":{"v":1862.6400000000003,"d":"1,863 $"}}]
[{"$nulls":15},"Puy-de-Dôme322","Puy-de-Dôme","Riz",{"$f":"donnees!E322","v":{"v":4107,"d":"4,107 $"}},{"$f":"donnees!G322","v":{"v":5274,"d":"5,274 $"}}]
[{"$nulls":15},"Puy-de-Dôme323","Puy-de-Dôme","Fromage",{"$f":"donnees!E323","v":{"v":6721.000000000001,"d":"6,721 $"}},{"$f":"donnees!G323","v":{"v":4908.200000000001,"d":"4,908 $"}}]
[{"$nulls":15},"Puy-de-Dôme324","Puy-de-Dôme","Sucre",{"$f":"donnees!E324","v":{"v":411.93000000000006,"d":"412 $"}},{"$f":"donnees!G324","v":{"v":1767.1200000000003,"d":"1,767 $"}}]
[{"$nulls":15},"Pyrénées-Atlantiques325","Pyrénées-Atlantiques","Lait",{"$f":"donnees!E325","v":{"v":111,"d":"111 $"}},{"$f":"donnees!G325","v":{"v":5127,"d":"5,127 $"}}]
[{"$nulls":15},"Pyrénées-Atlantiques326","Pyrénées-Atlantiques","Fromage",{"$f":"donnees!E326","v":{"v":1793.0000000000002,"d":"1,793 $"}},{"$f":"donnees!G326","v":{"v":5273.400000000001,"d":"5,273 $"}}]
[{"$nulls":15},"Pyrénées-Atlantiques327","Pyrénées-Atlantiques","Sucre",{"$f":"donnees!E327","v":{"v":871.6200000000001,"d":"872 $"}},{"$f":"donnees!G327","v":{"v":2173.08,"d":"2,173 $"}}]
[{"$nulls":15},"Pyrénées-Atlantiques328","Pyrénées-Atlantiques","Riz",{"$f":"donnees!E328","v":{"v":5832,"d":"5,832 $"}},{"$f":"donnees!G328","v":{"v":6375,"d":"6,375 $"}}]
[{"$nulls":15},{"$f":"Q329&ROW()","v":"Pyrénées-Atlantiques329"},"Pyrénées-Atlantiques","Yaourt",{"$f":"donnees!E329","v":{"v":2944.5,"d":"2,945 $"}},{"$f":"donnees!G329","v":{"v":2331,"d":"2,331 $"}}]
[{"$nulls":15},"Pyrénées-Orientales330","Pyrénées-Orientales","Yaourt",{"$f":"donnees!E330","v":{"v":1683,"d":"1,683 $"}},{"$f":"donnees!G330","v":{"v":1695,"d":"1,695 $"}}]
[{"$nulls":15},"Pyrénées-Orientales331","Pyrénées-Orientales","Fromage",{"$f":"donnees!E331","v":{"v":2494.8,"d":"2,495 $"}},{"$f":"donnees!G331","v":{"v":4483.6,"d":"4,484 $"}}]
[{"$nulls":15},"Pyrénées-Orientales332","Pyrénées-Orientales","Sucre",{"$f":"donnees!E332","v":{"v":216.91000000000003,"d":"217 $"}},{"$f":"donnees!G332","v":{"v":4535.210000000001,"d":"4,535 $"}}]
[{"$nulls":15},"Pyrénées-Orientales333","Pyrénées-Orientales","Lait",{"$f":"donnees!E333","v":{"v":1188,"d":"1,188 $"}},{"$f":"donnees!G333","v":{"v":6642,"d":"6,642 $"}}]
[{"$nulls":15},"Pyrénées-Orientales334","Pyrénées-Orientales","Riz",{"$f":"donnees!E334","v":{"v":6843,"d":"6,843 $"}},{"$f":"donnees!G334","v":{"v":2901,"d":"2,901 $"}}]
[{"$nulls":15},"Rhône335","Rhône","Sucre",{"$f":"donnees!E335","v":{"v":1796.9700000000003,"d":"1,797 $"}},{"$f":"donnees!G335","v":{"v":5299.370000000001,"d":"5,299 $"}}]
[{"$nulls":15},"Rhône336","Rhône","Riz",{"$f":"donnees!E336","v":{"v":5205,"d":"5,205 $"}},{"$f":"donnees!G336","v":{"v":2607,"d":"2,607 $"}}]
[{"$nulls":15},"Rhône337","Rhône","Yaourt",{"$f":"donnees!E337","v":{"v":199.5,"d":"200 $"}},{"$f":"donnees!G337","v":{"v":3963,"d":"3,963 $"}}]
[{"$nulls":15},"Rhône338","Rhône","Lait",{"$f":"donnees!E338","v":{"v":552,"d":"552 $"}},{"$f":"donnees!G338","v":{"v":4302,"d":"4,302 $"}}]
[{"$nulls":15},"Saône-et-Loire339","Saône-et-Loire","Sucre",{"$f":"donnees!E339","v":{"v":2391.9800000000005,"d":"2,392 $"}},{"$f":"donnees!G339","v":{"v":5146.140000000001,"d":"5,146 $"}}]
[{"$nulls":15},"Saône-et-Loire340","Saône-et-Loire","Lait",{"$f":"donnees!E340","v":{"v":3051,"d":"3,051 $"}},{"$f":"donnees!G340","v":{"v":3795,"d":"3,795 $"}}]
[{"$nulls":15},"Saône-et-Loire341","Saône-et-Loire","Fromage",{"$f":"donnees!E341","v":{"v":5425.200000000001,"d":"5,425 $"}},{"$f":"donnees!G341","v":{"v":3863.2000000000003,"d":"3,863 $"}}]
[{"$nulls":15},"Saône-et-Loire342","Saône-et-Loire","Riz",{"$f":"donnees!E342","v":{"v":234,"d":"234 $"}},{"$f":"donnees!G342","v":{"v":2775,"d":"2,775 $"}}]
[{"$nulls":15},"Saône-et-Loire343","Saône-et-Loire","Yaourt",{"$f":"donnees!E343","v":{"v":738,"d":"738 $"}},{"$f":"donnees!G343","v":{"v":2796,"d":"2,796 $"}}]
[{"$nulls":15},"Sarthe344","Sarthe","Riz",{"$f":"donnees!E344","v":{"v":3975,"d":"3,975 $"}},{"$f":"donnees!G344","v":{"v":5511,"d":"5,511 $"}}]
[{"$nulls":15},"Sarthe345","Sarthe","Lait",{"$f":"donnees!E345","v":{"v":4404,"d":"4,404 $"}},{"$f":"donnees!G345","v":{"v":4941,"d":"4,941 $"}}]
[{"$nulls":15},"Sarthe346","Sarthe","Yaourt",{"$f":"donnees!E346","v":{"v":112.5,"d":"113 $"}},{"$f":"donnees!G346","v":{"v":2863.5,"d":"2,864 $"}}]
[{"$nulls":15},"Sarthe347","Sarthe","Sucre",{"$f":"donnees!E347","v":{"v":4640.68,"d":"4,641 $"}},{"$f":"donnees!G347","v":{"v":5026.74,"d":"5,027 $"}}]
[{"$nulls":15},"Sarthe348","Sarthe","Fromage",{"$f":"donnees!E348","v":{"v":6091.8,"d":"6,092 $"}},{"$f":"donnees!G348","v":{"v":4833.400000000001,"d":"4,833 $"}}]
[{"$nulls":15},"Savoie349","Savoie","Lait",{"$f":"donnees!E349","v":{"v":6174,"d":"6,174 $"}},{"$f":"donnees!G349","v":{"v":7599,"d":"7,599 $"}}]
[{"$nulls":15},"Savoie350","Savoie","Riz",{"$f":"donnees!E350","v":{"v":1104,"d":"1,104 $"}},{"$f":"donnees!G350","v":{"v":6606,"d":"6,606 $"}}]
[{"$nulls":15},"Savoie351","Savoie","Fromage",{"$f":"donnees!E351","v":{"v":3319.8,"d":"3,320 $"}},{"$f":"donnees!G351","v":{"v":4131.6,"d":"4,132 $"}}]
[{"$nulls":15},"Savoie352","Savoie","Yaourt",{"$f":"donnees!E352","v":{"v":228,"d":"228 $"}},{"$f":"donnees!G352","v":{"v":3471,"d":"3,471 $"}}]
[{"$nulls":15},"Seine-et-Marne353","Seine-et-Marne","Lait",{"$f":"donnees!E353","v":{"v":8757,"d":"8,757 $"}},{"$f":"donnees!G353","v":{"v":3645,"d":"3,645 $"}}]
[{"$nulls":15},"Seine-et-Marne354","Seine-et-Marne","Sucre",{"$f":"donnees!E354","v":{"v":2873.5600000000004,"d":"2,874 $"}},{"$f":"donnees!G354","v":{"v":2105.42,"d":"2,105 $"}}]
[{"$nulls":15},"Seine-et-Marne355","Seine-et-Marne","Yaourt",{"$f":"donnees!E355","v":{"v":4606.5,"d":"4,607 $"}},{"$f":"donnees!G355","v":{"v":2626.5,"d":"2,627 $"}}]
[{"$nulls":15},"Seine-Maritime356","Seine-Maritime","Sucre",{"$f":"donnees!E356","v":{"v":1902.44,"d":"1,902 $"}},{"$f":"donnees!G356","v":{"v":3777.0200000000004,"d":"3,777 $"}}]
[{"$nulls":15},"Seine-Maritime357","Seine-Maritime","Riz",{"$f":"donnees!E357","v":{"v":1317,"d":"1,317 $"}},{"$f":"donnees!G357","v":{"v":3837,"d":"3,837 $"}}]
[{"$nulls":15},"Seine-Maritime358","Seine-Maritime","Lait",{"$f":"donnees!E358","v":{"v":10176,"d":"10,176 $"}},{"$f":"donnees!G358","v":{"v":4902,"d":"4,902 $"}}]
[{"$nulls":15},"Seine-Maritime359","Seine-Maritime","Yaourt",{"$f":"donnees!E359","v":{"v":3277.5,"d":"3,278 $"}},{"$f":"donnees!G359","v":{"v":1927.5,"d":"1,928 $"}}]
[{"$nulls":15},"Seine-Saint-Denis360","Seine-Saint-Denis","Lait",{"$f":"donnees!E360","v":{"v":9717,"d":"9,717 $"}},{"$f":"donnees!G360","v":{"v":5403,"d":"5,403 $"}}]
[{"$nulls":15},"Seine-Saint-Denis361","Seine-Saint-Denis","Fromage",{"$f":"donnees!E361","v":{"v":1493.8000000000002,"d":"1,494 $"}},{"$f":"donnees!G361","v":{"v":5031.400000000001,"d":"5,031 $"}}]
[{"$nulls":15},"Seine-Saint-Denis362","Seine-Saint-Denis","Riz",{"$f":"donnees!E362","v":{"v":4329,"d":"4,329 $"}},{"$f":"donnees!G362","v":{"v":7041,"d":"7,041 $"}}]
[{"$nulls":15},"Seine-Saint-Denis363","Seine-Saint-Denis","Yaourt",{"$f":"donnees!E363","v":{"v":4084.5,"d":"4,085 $"}},{"$f":"donnees!G363","v":{"v":2035.5,"d":"2,036 $"}}]
[{"$nulls":15},"Somme364","Somme","Lait",{"$f":"donnees!E364","v":{"v":5106,"d":"5,106 $"}},{"$f":"donnees!G364","v":{"v":6207,"d":"6,207 $"}}]
[{"$nulls":15},"Somme365","Somme","Fromage",{"$f":"donnees!E365","v":{"v":1797.4,"d":"1,797 $"}},{"$f":"donnees!G365","v":{"v":5445,"d":"5,445 $"}}]
[{"$nulls":15},"Somme366","Somme","Riz",{"$f":"donnees!E366","v":{"v":4878,"d":"4,878 $"}},{"$f":"donnees!G366","v":{"v":5730,"d":"5,730 $"}}]
[{"$nulls":15},"Somme367","Somme","Sucre",{"$f":"donnees!E367","v":{"v":2465.6100000000006,"d":"2,466 $"}},{"$f":"donnees!G367","v":{"v":2823.8100000000004,"d":"2,824 $"}}]
[{"$nulls":15},"Somme368","Somme","Yaourt",{"$f":"donnees!E368","v":{"v":1095,"d":"1,095 $"}},{"$f":"donnees!G368","v":{"v":2469,"d":"2,469 $"}}]
[{"$nulls":15},"Tarn369","Tarn","Lait",{"$f":"donnees!E369","v":{"v":6357,"d":"6,357 $"}},{"$f":"donnees!G369","v":{"v":7080,"d":"7,080 $"}}]
[{"$nulls":15},"Tarn370","Tarn","Yaourt",{"$f":"donnees!E370","v":{"v":4203,"d":"4,203 $"}},{"$f":"donnees!G370","v":{"v":3091.5,"d":"3,092 $"}}]
[{"$nulls":15},"Tarn371","Tarn","Fromage",{"$f":"donnees!E371","v":{"v":3533.2000000000003,"d":"3,533 $"}},{"$f":"donnees!G371","v":{"v":3262.6000000000004,"d":"3,263 $"}}]
[{"$nulls":15},"Tarn372","Tarn","Sucre",{"$f":"donnees!E372","v":{"v":2282.5300000000007,"d":"2,283 $"}},{"$f":"donnees!G372","v":{"v":3058.63,"d":"3,059 $"}}]
[{"$nulls":15},"Tarn-et-Garonne373","Tarn-et-Garonne","Lait",{"$f":"donnees!E373","v":{"v":3591,"d":"3,591 $"}},{"$f":"donnees!G373","v":{"v":2826,"d":"2,826 $"}}]
[{"$nulls":15},"Tarn-et-Garonne374","Tarn-et-Garonne","Fromage",{"$f":"donnees!E374","v":{"v":8014.6,"d":"8,015 $"}},{"$f":"donnees!G374","v":{"v":4345,"d":"4,345 $"}}]
[{"$nulls":15},"Tarn-et-Garonne375","Tarn-et-Garonne","Sucre",{"$f":"donnees!E375","v":{"v":3174.05,"d":"3,174 $"}},{"$f":"donnees!G375","v":{"v":2276.5600000000004,"d":"2,277 $"}}]
[{"$nulls":15},"Tarn-et-Garonne376","Tarn-et-Garonne","Yaourt",{"$f":"donnees!E376","v":{"v":3817.5,"d":"3,818 $"}},{"$f":"donnees!G376","v":{"v":2892,"d":"2,892 $"}}]
[{"$nulls":15},"Tarn-et-Garonne377","Tarn-et-Garonne","Riz",{"$f":"donnees!E377","v":{"v":3966,"d":"3,966 $"}},{"$f":"donnees!G377","v":{"v":3846,"d":"3,846 $"}}]
[{"$nulls":15},"Territoire de Belfort378","Territoire de Belfort","Yaourt",{"$f":"donnees!E378","v":{"v":2791.5,"d":"2,792 $"}},{"$f":"donnees!G378","v":{"v":1249.5,"d":"1,250 $"}}]
[{"$nulls":15},"Territoire de Belfort379","Territoire de Belfort","Sucre",{"$f":"donnees!E379","v":{"v":181.09000000000003,"d":"181 $"}},{"$f":"donnees!G379","v":{"v":1717.3700000000003,"d":"1,717 $"}}]
[{"$nulls":15},"Territoire de Belfort380","Territoire de Belfort","Fromage",{"$f":"donnees!E380","v":{"v":6228.200000000001,"d":"6,228 $"}},{"$f":"donnees!G380","v":{"v":3165.8,"d":"3,166 $"}}]
[{"$nulls":15},"Territoire de Belfort381","Territoire de Belfort","Lait",{"$f":"donnees!E381","v":{"v":1761,"d":"1,761 $"}},{"$f":"donnees!G381","v":{"v":4323,"d":"4,323 $"}}]
[{"$nulls":15},"Territoire de Belfort382","Territoire de Belfort","Riz",{"$f":"donnees!E382","v":{"v":5556,"d":"5,556 $"}},{"$f":"donnees!G382","v":{"v":4491,"d":"4,491 $"}}]
[{"$nulls":15},"Val-de-Marne383","Val-de-Marne","Fromage",{"$f":"donnees!E383","v":{"v":1513.6000000000001,"d":"1,514 $"}},{"$f":"donnees!G383","v":{"v":4004,"d":"4,004 $"}}]
[{"$nulls":15},"Val-de-Marne384","Val-de-Marne","Lait",{"$f":"donnees!E384","v":{"v":804,"d":"804 $"}},{"$f":"donnees!G384","v":{"v":6054,"d":"6,054 $"}}]
[{"$nulls":15},"Val-de-Marne385","Val-de-Marne","Riz",{"$f":"donnees!E385","v":{"v":5667,"d":"5,667 $"}},{"$f":"donnees!G385","v":{"v":4791,"d":"4,791 $"}}]
[{"$nulls":15},"Val-de-Marne386","Val-de-Marne","Sucre",{"$f":"donnees!E386","v":{"v":1637.77,"d":"1,638 $"}},{"$f":"donnees!G386","v":{"v":4364.07,"d":"4,364 $"}}]
[{"$nulls":15},"Val-d'Oise387","Val-d'Oise","Lait",{"$f":"donnees!E387","v":{"v":2190,"d":"2,190 $"}},{"$f":"donnees!G387","v":{"v":7956,"d":"7,956 $"}}]
[{"$nulls":15},"Val-d'Oise388","Val-d'Oise","Riz",{"$f":"donnees!E388","v":{"v":6735,"d":"6,735 $"}},{"$f":"donnees!G388","v":{"v":4632,"d":"4,632 $"}}]
[{"$nulls":15},"Val-d'Oise389","Val-d'Oise","Yaourt",{"$f":"donnees!E389","v":{"v":3469.5,"d":"3,470 $"}},{"$f":"donnees!G389","v":{"v":2262,"d":"2,262 $"}}]
[{"$nulls":15},"Val-d'Oise390","Val-d'Oise","Sucre",{"$f":"donnees!E390","v":{"v":628.8400000000001,"d":"629 $"}},{"$f":"donnees!G390","v":{"v":2113.38,"d":"2,113 $"}}]
[{"$nulls":15},"Var391","Var","Fromage",{"$f":"donnees!E391","v":{"v":2444.2000000000003,"d":"2,444 $"}},{"$f":"donnees!G391","v":{"v":5563.8,"d":"5,564 $"}}]
[{"$nulls":15},"Var392","Var","Lait",{"$f":"donnees!E392","v":{"v":4182,"d":"4,182 $"}},{"$f":"donnees!G392","v":{"v":4749,"d":"4,749 $"}}]
[{"$nulls":15},{"$f":"Q393&ROW()","v":"Var393"},"Var","Yaourt",{"$f":"donnees!E393","v":{"v":3106.5,"d":"3,107 $"}},{"$f":"donnees!G393","v":{"v":3441,"d":"3,441 $"}}]
[{"$nulls":15},"Vaucluse394","Vaucluse","Sucre",{"$f":"donnees!E394","v":{"v":1904.4300000000003,"d":"1,904 $"}},{"$f":"donnees!G394","v":{"v":5251.610000000001,"d":"5,252 $"}}]
[{"$nulls":15},"Vaucluse395","Vaucluse","Fromage",{"$f":"donnees!E395","v":{"v":7807.8,"d":"7,808 $"}},{"$f":"donnees!G395","v":{"v":4468.200000000001,"d":"4,468 $"}}]
[{"$nulls":15},"Vaucluse396","Vaucluse","Yaourt",{"$f":"donnees!E396","v":{"v":330,"d":"330 $"}},{"$f":"donnees!G396","v":{"v":3208.5,"d":"3,209 $"}}]
[{"$nulls":15},"Vaucluse397","Vaucluse","Lait",{"$f":"donnees!E397","v":{"v":2235,"d":"2,235 $"}},{"$f":"donnees!G397","v":{"v":8067,"d":"8,067 $"}}]
[{"$nulls":15},"Vaucluse398","Vaucluse","Riz",{"$f":"donnees!E398","v":{"v":2544,"d":"2,544 $"}},{"$f":"donnees!G398","v":{"v":4467,"d":"4,467 $"}}]
[{"$nulls":15},"Vendée399","Vendée","Lait",{"$f":"donnees!E399","v":{"v":8031,"d":"8,031 $"}},{"$f":"donnees!G399","v":{"v":2442,"d":"2,442 $"}}]
[{"$nulls":15},"Vendée400","Vendée","Sucre",{"$f":"donnees!E400","v":{"v":3408.870000000001,"d":"3,409 $"}},{"$f":"donnees!G400","v":{"v":2867.59,"d":"2,868 $"}}]
[{"$nulls":15},"Vendée401","Vendée","Fromage",{"$f":"donnees!E401","v":{"v":5046.8,"d":"5,047 $"}},{"$f":"donnees!G401","v":{"v":2180.2000000000003,"d":"2,180 $"}}]
[{"$nulls":15},"Vendée402","Vendée","Riz",{"$f":"donnees!E402","v":{"v":9519,"d":"9,519 $"}},{"$f":"donnees!G402","v":{"v":6243,"d":"6,243 $"}}]
[{"$nulls":15},"Vendée403","Vendée","Yaourt",{"$f":"donnees!E403","v":{"v":1731,"d":"1,731 $"}},{"$f":"donnees!G403","v":{"v":1396.5,"d":"1,397 $"}}]
[{"$nulls":15},"Vienne404","Vienne","Yaourt",{"$f":"donnees!E404","v":{"v":3276,"d":"3,276 $"}},{"$f":"donnees!G404","v":{"v":1272,"d":"1,272 $"}}]
[{"$nulls":15},"Vienne405","Vienne","Lait",{"$f":"donnees!E405","v":{"v":2373,"d":"2,373 $"}},{"$f":"donnees!G405","v":{"v":7707,"d":"7,707 $"}}]
[{"$nulls":15},"Vienne406","Vienne","Sucre",{"$f":"donnees!E406","v":{"v":2722.3200000000006,"d":"2,722 $"}},{"$f":"donnees!G406","v":{"v":2720.33,"d":"2,720 $"}}]
[{"$nulls":15},"Vienne407","Vienne","Riz",{"$f":"donnees!E407","v":{"v":5844,"d":"5,844 $"}},{"$f":"donnees!G407","v":{"v":5982,"d":"5,982 $"}}]
[{"$nulls":15},"Vienne408","Vienne","Fromage",{"$f":"donnees!E408","v":{"v":1372.8000000000002,"d":"1,373 $"}},{"$f":"donnees!G408","v":{"v":5786.000000000001,"d":"5,786 $"}}]
[{"$nulls":15},"Vosges409","Vosges","Yaourt",{"$f":"donnees!E409","v":{"v":3159,"d":"3,159 $"}},{"$f":"donnees!G409","v":{"v":1614,"d":"1,614 $"}}]
[{"$nulls":15},"Vosges410","Vosges","Lait",{"$f":"donnees!E410","v":{"v":3372,"d":"3,372 $"}},{"$f":"donnees!G410","v":{"v":6834,"d":"6,834 $"}}]
[{"$nulls":15},"Vosges411","Vosges","Riz",{"$f":"donnees!E411","v":{"v":4446,"d":"4,446 $"}},{"$f":"donnees!G411","v":{"v":6258,"d":"6,258 $"}}]
[{"$nulls":15},"Yonne412","Yonne","Lait",{"$f":"donnees!E412","v":{"v":4125,"d":"4,125 $"}},{"$f":"donnees!G412","v":{"v":6672,"d":"6,672 $"}}]
[{"$nulls":15},"Yonne413","Yonne","Sucre",{"$f":"donnees!E413","v":{"v":648.74,"d":"649 $"}},{"$f":"donnees!G413","v":{"v":3016.84,"d":"3,017 $"}}]
[{"$nulls":15},"Yonne414","Yonne","Fromage",{"$f":"donnees!E414","v":{"v":2208.8,"d":"2,209 $"}},{"$f":"donnees!G414","v":{"v":2409,"d":"2,409 $"}}]
[{"$nulls":15},"Yonne415","Yonne","Yaourt",{"$f":"donnees!E415","v":{"v":904.5,"d":"905 $"}},{"$f":"donnees!G415","v":{"v":3255,"d":"3,255 $"}}]
[{"$nulls":15},"Yvelines416","Yvelines","Yaourt",{"$f":"donnees!E416","v":{"v":382.5,"d":"383 $"}},{"$f":"donnees!G416","v":{"v":2158.5,"d":"2,159 $"}}]
[{"$nulls":15},"Yvelines417","Yvelines","Fromage",{"$f":"donnees!E417","v":{"v":1216.6000000000001,"d":"1,217 $"}},{"$f":"donnees!G417","v":{"v":3256.0000000000005,"d":"3,256 $"}}]
[{"$nulls":15},"Yvelines418","Yvelines","Lait",{"$f":"donnees!E418","v":{"v":8643,"d":"8,643 $"}},{"$f":"donnees!G418","v":{"v":5406,"d":"5,406 $"}}]
[{"$nulls":15},"Yvelines419","Yvelines","Riz",{"$f":"donnees!E419","v":{"v":7230,"d":"7,230 $"}},{"$f":"donnees!G419","v":{"v":4824,"d":"4,824 $"}}]
[{"$nulls":15},"Yvelines420","Yvelines","Sucre",{"$f":"donnees!E420","v":{"v":4206.860000000001,"d":"4,207 $"}},{"$f":"donnees!G420","v":{"v":3010.87,"d":"3,011 $"}}]